5-Hepten-3-one, 2-(5-ethenyltetrahydro-5-methyl-2-furanyl)-6-methyl-, [2S-[2α(R*),5α]]-

Normal alkane RI, non-polar column, temperature ramp

Data compiled by: NIST Mass Spectrometry Data Center, William E. Wallace, director

Column type CapillaryCapillaryCapillaryCapillaryCapillary
Active phase OV-1DBP-5DBP-5DB-1DB-5
Column length (m) 30.25.25.60.25.
Carrier gas HeliumHeliumHelium N2
Substrate
Column diameter (mm) 0.250.250.250.250.25
Phase thickness (μm) 0.250.220.220.250.15
Tstart (C) 40.40.40.60.50.
Tend (C) 300.250.250.250.200.
Heat rate (K/min) 4.3.3.5.4.
Initial hold (min) 2.1.1. 3.
Final hold (min) 10.10.10.10.
I 1561.1554.1554.1567.1552.
ReferenceNibret and Wink, 2009Heravi and Sereshti, 2007Sereshti and Samadi, 2007Hadian, Sonboli, et al., 2006Ouamba, Ouabonzi, et al., 2006
Comment MSDC-RI MSDC-RI MSDC-RI MSDC-RI MSDC-RI
Column type CapillaryCapillaryCapillaryCapillaryCapillary
Active phase HP-5MSDB-5HP-5MSDB-1SPB-1
Column length (m) 30.30.30.50.30.
Carrier gas HeHeHeN2N2
Substrate
Column diameter (mm) 0.250.250.250.250.25
Phase thickness (μm) 0.250.250.250.250.25
Tstart (C) 60.35.60.95.70.
Tend (C) 275.220.280.240.180.
Heat rate (K/min) 4.2.54.4.2.
Initial hold (min)     2.
Final hold (min)  6.  1.
I 1593.1588.1608.1580.1553.
ReferenceHajhashemi V., Ghannadi A., et al., 2004Rohloff, Mordal, et al., 2004Sadeghpour, Asghari, et al., 2004Perez-Alonso, Velasco-Negueruela, et al., 2003Kamath, Asha, et al., 2001
Comment MSDC-RI MSDC-RI MSDC-RI MSDC-RI MSDC-RI
Column type Capillary
Active phase BP-1
Column length (m) 25.
Carrier gas N2
Substrate
Column diameter (mm) 0.50
Phase thickness (μm) 0.25
Tstart (C) 60.
Tend (C) 220.
Heat rate (K/min) 5.
Initial hold (min)
Final hold (min) 10.
I 1567.
ReferenceMallavarapu, Kulkarni, et al., 1999
Comment MSDC-RI

Van Den Dool and Kratz RI, non-polar column, temperature ramp

Data compiled by: NIST Mass Spectrometry Data Center, William E. Wallace, director

Column type CapillaryCapillaryCapillaryCapillaryCapillary
Active phase DB-1DB-1HP-5MSDB-5DB-5
Column length (m) 30.30.30.30.30.
Carrier gas He HeHeHe
Substrate
Column diameter (mm) 0.250.250.250.250.25
Phase thickness (μm) 0.250.250.25
Tstart (C) 50.50.50.50.50.
Tend (C) 265.265.250.250.250.
Heat rate (K/min) 2.52.53.3.3.
Initial hold (min)
Final hold (min)
I 1559.1561.1592.1586.1568.
ReferenceRamezani, Behravan, et al., 2006Ramezani, Behravan, et al., 2004Salido, Valenzuela, et al., 2004Isidorov, Zenkevich, et al., 2001Isidorov, Zenkevich, et al., 2001
Comment MSDC-RI MSDC-RI MSDC-RI MSDC-RI MSDC-RI
Column type Capillary
Active phase HP-5MS
Column length (m) 30.
Carrier gas He
Substrate
Column diameter (mm) 0.25
Phase thickness (μm) 0.25
Tstart (C) 50.
Tend (C) 250.
Heat rate (K/min) 3.
Initial hold (min)
Final hold (min)
I 1592.
ReferenceSalido, Altarejos, et al., 2001
Comment MSDC-RI

Normal alkane RI, non-polar column, custom temperature program

Data compiled by: NIST Mass Spectrometry Data Center, William E. Wallace, director

Column type CapillaryCapillaryCapillaryCapillary
Active phase HP-5 MSBP-5CP Sil 8 CBDB-5
Column length (m) 30.30.50.30.
Carrier gas HeliumHeHeHe
Substrate
Column diameter (mm) 0.250.320.320.25
Phase thickness (μm) 0.250.250.25
Program 60 0C (1 min) 10 0C/min -> 180 0C (1 min) 20 0C/min -> 280 0C (15 min)60C => 4C/min => 150C => 10C/min => 220C60C(2min) => 5C/min => 160C(1min) => 10C/min => 250C (5min)not specified
I 1608.1609.1588.1586.
ReferenceLiu, Chu, et al., 2010Hashemi, Abolghasemi, et al., 2007Judzentiene and Buzelyte, 2006Isidorov, Zenkevich, et al., 2001
Comment MSDC-RI MSDC-RI MSDC-RI MSDC-RI

References

Nibret and Wink, 2009
Nibret, E.; Wink, M., Volatile components of four Ethiopian Artemisia species extracts and their in vitro antipatrypanosomal and cytotoxic activities, Phytomedicine, 2009, 00, 0, 000-000. [all data]

Heravi and Sereshti, 2007
Heravi, M.J.; Sereshti, H., Determination of Essential Oil Components of Artemisia haussknechtii Boiss. using Simultaneous Hydrodistillation-Static Headspace Liquid Phase Microextraction - Gas Chromatography Mass Spectrometry, J. Chromatogr. A, 2007, 1160, 1-2, 81-89, https://doi.org/10.1016/j.chroma.2007.05.096 . [all data]

Sereshti and Samadi, 2007
Sereshti, H.; Samadi, S., Comparison of hydrodistillation-headspace liquid phase microextraction techniques with hydrodistillation in determination of essential oils in Artemisia Haussknechtii Boiss, JSUT, 2007, 33, 2, 7-17. [all data]

Hadian, Sonboli, et al., 2006
Hadian, J.; Sonboli, A.; Ebrahimi, S.N.; Mirjalili, M.H., Essential oil composition of Nepeta satureioides from Iran, Chem. Nat. Compd. (Engl. Transl.), 2006, 42, 2, 175-177, https://doi.org/10.1007/s10600-006-0071-0 . [all data]

Ouamba, Ouabonzi, et al., 2006
Ouamba, J.-M.; Ouabonzi, A.; Ekouya, A.; Bessière, J.-M.; Menut, C.; Abena, A.A.; Banzouzi, J.-T., Volatile constituents of the essential oil leaf of Lantana salvifolia Jacq. (Verbenaceae), Flavour Fragr. J., 2006, 21, 1, 158-161, https://doi.org/10.1002/ffj.1553 . [all data]

Hajhashemi V., Ghannadi A., et al., 2004
Hajhashemi V.; Ghannadi A.; Jafarabadi H., Black cumin seed essential oil, as a potent analgesic and antiinflammatory drug, Phytother. Res., 2004, 18, 3, 195-199, https://doi.org/10.1002/ptr.1390 . [all data]

Rohloff, Mordal, et al., 2004
Rohloff, J.; Mordal, R.; Dragland, S., Chemotypical variation of tansy (Tanacetum vulgare L.) from 40 different locations in Norway, J. Agric. Food Chem., 2004, 52, 6, 1742-1748, https://doi.org/10.1021/jf0352430 . [all data]

Sadeghpour, Asghari, et al., 2004
Sadeghpour, O.; Asghari, G.; Ardekani, M.R.S., Composition of essential oil of Artemisia persica Boiss. from Iran, Iran. J. Pharm. Res., 2004, 3, 65-67. [all data]

Perez-Alonso, Velasco-Negueruela, et al., 2003
Perez-Alonso, M.J.; Velasco-Negueruela, A.; Palá-Paúl, J.; Sanz, J., Variations in the essential oil composition of Artemisia pedemontana gathered in Spain: chemotype camphor-1,8-cineole and chemotype davanone, Biochem. Syst. Ecol., 2003, 31, 1, 77-84, https://doi.org/10.1016/S0305-1978(02)00082-0 . [all data]

Kamath, Asha, et al., 2001
Kamath, A.; Asha, M.R.; Ravi, R.; Narasimhan, S.; Rajalakshmi, D., Comparative study of odour and GC-olfactometric profiles of selected essential oils, Flavour Fragr. J., 2001, 16, 6, 401-407, https://doi.org/10.1002/ffj.1020 . [all data]

Mallavarapu, Kulkarni, et al., 1999
Mallavarapu, G.R.; Kulkarni, R.N.; Baskaran, K.; Rao, L.; Ramesh, S., Influence of plant growth stage on the essential oil content and composition in Davana (Artemisia pallens Wall.), J. Agric. Food Chem., 1999, 47, 1, 254-258, https://doi.org/10.1021/jf980624c . [all data]