Tricyclo[4.4.0.0(2,7)]decane, 1-methyl-3-methylene-8-(1-methylethyl)-, stereoisomer

Kovats' RI, non-polar column, isothermal

Data compiled by: NIST Mass Spectrometry Data Center, William E. Wallace, director

Column type Packed
Active phase SE-30
Column length (m)
Carrier gas He
Substrate Chromosorb G
Column diameter (mm)
Phase thickness (μm)
Temperature (C) 130.
I 1417.5
ReferenceAndersen and Falcone, 1969
Comment MSDC-RI

Normal alkane RI, polar column, custom temperature program

Data compiled by: NIST Mass Spectrometry Data Center, William E. Wallace, director

Column type CapillaryCapillaryCapillaryCapillaryCapillary
Active phase Innowax FSCHP-Innowax FSCInnowax FSCInnowax FSCInnowax FSC
Column length (m) 60.60.60.60.60.
Carrier gas HeliumN2NitrogenHeHe
Substrate
Column diameter (mm) 0.250.250.250.250.25
Phase thickness (μm) 0.250.250.250.250.25
Program 60 0C (10 min) 4 0C/min -> 220 0C (10 min) 1 oC/min -> 240 0C60C(10min) => 4C/min => 220C(10min) => 1C/min => 240C60 0C (10 min) 1 0C/min -> 220 0C (10 min) 1 0C/min -> 240 0C60C(10min) => 4C/min >220C (10min) => 1C/min => 240C60C(10min) => 4C/min >220C (10min) => 1C/min => 240C
I 1589.1589.1589.1589.1589.
ReferenceAkin, Saracoglu, et al., 2012Baser K.H.C. and Demirci B., 2007Kaya, Benirci, et al., 2007Baser, Özek, et al., 2006Baser, Özek, et al., 2006
Comment MSDC-RI MSDC-RI MSDC-RI MSDC-RI MSDC-RI
Column type CapillaryCapillaryCapillaryCapillaryCapillary
Active phase HP-Innowax FSCHP-Innowax FSCHP-InnowaxDB-WaxHP-Innowax FSC
Column length (m) 60.60.60. 60.
Carrier gas N2N2N2N2N2
Substrate
Column diameter (mm) 0.250.250.25 0.25
Phase thickness (μm) 0.250.250.25 0.25
Program 60C(10min) => 4C/min => 220C(10min) => 1C/min => 240C60C(10min) => 4C/min => 220C (10min) => 1C/min => 240C60C(10min) => 4C/min => 220C(10min) => 1C/min => 240Cnot specified60C(10min) => 4C/min => 220C(10min) => 1C/min => 240C
I 1589.1589.1589.1573.1589.
ReferenceTunalier, Candan, et al., 2006Demirci, Demirci, et al., 2005Duman, Kartal, et al., 2005Pala-Paul, Perez-Alonso, et al., 2005Demirci, Paper, et al., 2004
Comment MSDC-RI MSDC-RI MSDC-RI MSDC-RI MSDC-RI
Column type CapillaryCapillaryCapillaryCapillaryCapillary
Active phase HP-Innowax FSCInnowax FSCHP-Innowax FSCHP-Innowax FSCHP-Innowax
Column length (m) 60.60.60.60.60.
Carrier gas HeHeHeHeHe
Substrate
Column diameter (mm) 0.250.250.250.250.25
Phase thickness (μm) 0.250.250.250.250.25
Program 60C(10min) => 4C/min => 220C(10min) => 1C/min => 240C60C(10min) => 4C/min => 220C (10min) => 1C/min => 240C60C (10min) => 4C/min => 220C (10min) => 1C/min => 240C60C(10min) => 4C/min => 220C(10min) => 1C/min => 240C60 0C (10 min) 4 K/min -> 220 0C (10 min) 1 K/min -> 240 0C
I 1589.1572.1589.1589.1589.
ReferenceKivcak, Akay, et al., 2004Baser, Demirci, et al., 2003Demirci, Baser, et al., 2003Demirci, Dadandi, et al., 2003Demirci, Baser, et al., 2002
Comment MSDC-RI MSDC-RI MSDC-RI MSDC-RI MSDC-RI

Normal alkane RI, non-polar column, custom temperature program

Data compiled by: NIST Mass Spectrometry Data Center, William E. Wallace, director

Column type CapillaryCapillaryCapillaryCapillaryCapillary
Active phase 5 % Phenyl polydimethyl siloxaneDB-5DB-5CP Sil 8 CBDB-5
Column length (m)  30.50.50.30.
Carrier gas  HeliumHeliumHeHe
Substrate
Column diameter (mm)  0.250.320.320.25
Phase thickness (μm)  0.250.250.250.25
Program not specified50 0C m6 0C/min -> 140 0C 5 0C/min -> 160 0C (1 min) 10 0C/min -> 200 0C60 0C (2 min) 5 0C/min -> 160 0C (1 min) 10 0C/min -> 250 0C (3 min)60 0C (2 min) 5 0C/min -> 160 0C 5 0C/min -> 250 0C (10 min)50C(1min) => 3C/min => 250C(10min) => 20C/min => 280C (5min)
I 1419.1424.1420.1421.1421.
ReferenceChaverri, Diaz, et al., 2011Courtois, Paine, et al., 2009Judzentiene and Budiene, 2008Mockute, Bernotiene, et al., 2007Parker, Pollnitz, et al., 2007
Comment MSDC-RI MSDC-RI MSDC-RI MSDC-RI MSDC-RI
Column type CapillaryCapillaryCapillaryCapillaryCapillary
Active phase 5 % Phenyl methylsiloxaneCP Sil 8 CBSE-52BPX5CP Sil 8 CB
Column length (m)  50.30.25.50.
Carrier gas  HeHeHeliumHe
Substrate
Column diameter (mm)  0.320.320.220.32
Phase thickness (μm)  0.250.150.250.25
Program not specified60 0C (2 min) 5 0C/min -> 160 0C 10 0C/min -> 250 0C (5 min)45C => 1C/min => 100C => 5C/min => 250C (10min)not specified60C(1min) => 5C/min => 160C => 5C/min => 250C(3min)
I 1451.1421.1421.1420.1421.
ReferenceSerrano, Cornu, et al., 2007Mockute, Bernotiene, et al., 2006Tognolini, Barocelli, et al., 2006Dickschat, Bode, et al., 2005Nivinskienë, Butkienë, et al., 2005
Comment MSDC-RI MSDC-RI MSDC-RI MSDC-RI MSDC-RI
Column type CapillaryCapillary
Active phase SE-30Methyl Silicone
Column length (m)
Carrier gas
Substrate
Column diameter (mm)
Phase thickness (μm)
Program not specifiednot specified
I 1405.1405.
ReferenceVinogradov, 2004Zenkevich, 1996
Comment MSDC-RI MSDC-RI

References

Andersen and Falcone, 1969
Andersen, N.H.; Falcone, M.S., The identification of sesquiterpene hydrocarbons from gas-liquid chromatography retention data, J. Chromatogr., 1969, 44, 52-59, https://doi.org/10.1016/S0021-9673(01)92497-5 . [all data]