Bicyclo[6.2.0]decapentaene

Gas phase thermochemistry data

Data compiled by: Hussein Y. Afeefy, Joel F. Liebman, and Stephen E. Stein

Quantity Value Units Method Reference Comment
Δfgas122.9kcal/molChydRoth, Lennartz, et al., 1986

Reaction thermochemistry data

Data compiled by: Hussein Y. Afeefy, Joel F. Liebman, and Stephen E. Stein

Individual Reactions

5Hydrogen + Bicyclo[6.2.0]decapentaene = Bicyclo[6.2.0]decane, trans-

By formula: 5H2 + C10H8 = C10H18

Quantity Value Units Method Reference Comment
Δr-135.6 ± 0.8kcal/molChydRoth, Lennartz, et al., 1986liquid phase; solvent: Cyclohexane

References

Roth, Lennartz, et al., 1986
Roth, W.E.; Lennartz, H.W.; Vogel, E.; Leiendecker, M.; Masaji, O., Heats of hydrogenation. 6. Resonance energy of fused [4n]annulenes, Chem. Ber., 1986, 119, 837-843. [all data]