copper dihydroxide

Condensed phase thermochemistry data

Quantity Value Units Method Reference Comment
Δfsolid-450.37kJ/molReviewChase, 1998Data last reviewed in June, 1966
Quantity Value Units Method Reference Comment
solid108.43J/mol*KReviewChase, 1998Data last reviewed in June, 1966

Solid Phase Heat Capacity (Shomate Equation)

Cp° = A + B*t + C*t2 + D*t3 + E/t2
H° − H°298.15= A*t + B*t2/2 + C*t3/3 + D*t4/4 − E/t + F − H
S° = A*ln(t) + B*t + C*t2/2 + D*t3/3 − E/(2*t2) + G
    Cp = heat capacity (J/mol*K)
    H° = standard enthalpy (kJ/mol)
    S° = standard entropy (J/mol*K)
    t = temperature (K) / 1000.

View plot Requires a JavaScript / HTML 5 canvas capable browser.

View table.

Temperature (K) 298. - 1500.
A 53.54851
B 131.8144
C -84.70090
D 18.07664
E 0.838997
F -468.6415
G 142.2598
H -450.3658
ReferenceChase, 1998
Comment Data last reviewed in June, 1966

References

Chase, 1998
Chase, M.W., Jr., NIST-JANAF Themochemical Tables, Fourth Edition, J. Phys. Chem. Ref. Data, Monograph 9, 1998, 1-1951. [all data]