Naphtho[1,8-de]-1,3-dithiin

Gas phase ion energetics data

Data compiled by: Sharon G. Lias, Rhoda D. Levin, and Sherif A. Kafafi

Ionization energy determinations

IE (eV) Method Reference Comment
7.3PEBock, Brahler, et al., 1981
7.41PEBock, Brahler, et al., 1981Vertical value

References

Bock, Brahler, et al., 1981
Bock, H.; Brahler, G.; Dauplaise, D.; Meinwald, J., One-electron oxidation of 1,8-chalcogen-bridged naphthalenes, Chem. Ber., 1981, 114, 2622. [all data]