diethylaluminium iodide

Condensed phase thermochemistry data

Data compiled by: José A. Martinho Simões

Quantity Value Units Method Reference Comment
Δfliquid-59.82 ± 0.84kcal/molReviewMartinho SimõesThe enthalpy of formation relies on -44.8 ± 1.2 kcal/mol for the enthalpy of formation of Al(Et)3(l).

Reaction thermochemistry data

Data compiled by: José A. Martinho Simões

Individual Reactions

AlI3 (cr) + 2Aluminum, triethyl- (l) = 3C4H10AlI (l)

By formula: AlI3 (cr) + 2C6H15Al (l) = 3C4H10AlI (l)

Quantity Value Units Method Reference Comment
Δr-17.5 ± 0.33kcal/molRSCSmith, 1974Please also see Pedley and Rylance, 1977.

C2H5AlI2 (l) + Aluminum, triethyl- (l) = 2C4H10AlI (l)

By formula: C2H5AlI2 (l) + C6H15Al (l) = 2C4H10AlI (l)

Quantity Value Units Method Reference Comment
Δr-8.7 ± 0.2kcal/molRSCSmith, 1974Please also see Pedley and Rylance, 1977.

References

Martinho Simões
Martinho Simões, J.A., Private communication (see http://webbook.nist.gov/chemistry/om/). [all data]

Smith, 1974
Smith, M.B., J. Organometal. Chem., 1974, 76, 171. [all data]

Pedley and Rylance, 1977
Pedley, J.B.; Rylance, J., Computer Analysed Thermochemical Data: Organic and Organometallic Compounds, University of Sussex, Brigton, 1977. [all data]