Benzene, 2-ethenyl-1,4-dimethyl-

Normal alkane RI, non-polar column, custom temperature program

Data compiled by: NIST Mass Spectrometry Data Center, William E. Wallace, director

Column type CapillaryCapillaryCapillaryCapillaryCapillary
Active phase DB-1HP-5DB-1DB-1DB-1
Column length (m) 30.30.30.30.30.
Carrier gas HydrogenNitrogenHydrogenHydrogenHe
Substrate
Column diameter (mm) 0.250.350.250.250.25
Phase thickness (μm) 0.250.250.250.250.25
Program 45 0C 3 0C/min -> 175 0C 15 0C/min -> 300 0C (10 min)60 0C 3 0C/min -> 210 0C 5 0C/min -> 250 0C (2 min)45 0C 3 0C/min -> 175 0C 15 0C/min -> 300 0C (10 min)45 0C 3 0C/min -> 175 0C 15 0C/min -> 300 0C (10 min)45C => 3C/min => 175C => 15C/min => 300C (10min)
I 1059.1101.1059.1059.1059.
ReferenceAlbano, Lima, et al., 2012Veres, Csupor-Loffler, et al., 2012Mendes, Trindade, et al., 2009Mendes, Trindade, et al., 2009, 2Figueiredo, Sim-Sim, et al., 2005
Comment MSDC-RI MSDC-RI MSDC-RI MSDC-RI MSDC-RI
Column type CapillaryCapillaryCapillaryCapillary
Active phase Polymethylsiloxane, (PMS-20000)DB-1OV-1, SE-30, Methyl silicone, SP-2100, OV-101, DB-1, etc.OV-1, SE-30, Methyl silicone, SP-2100, OV-101, DB-1, etc.
Column length (m)  30.50.50.
Carrier gas  HeHydrogenHydrogen
Substrate
Column diameter (mm)  0.250.320.32
Phase thickness (μm)  0.25
Program not specified45C => 3C/min => 175C => 15C/min => 300C(10min)not specifiednot specified
I 1079.1059.1076.1080.
ReferenceCornwell and Cordano, 2003Santos, Figueiredo, et al., 1999Waggott and Davies, 1984Waggott and Davies, 1984
Comment MSDC-RI MSDC-RI MSDC-RI MSDC-RI

Phase change data

Data compiled as indicated in comments:
BS - Robert L. Brown and Stephen E. Stein
TRC - Thermodynamics Research Center, NIST Boulder Laboratories, Chris Muzny director
AC - William E. Acree, Jr., James S. Chickos

Quantity Value Units Method Reference Comment
Tfus238.KN/ASchwartzman and Corson, 1956Uncertainty assigned by TRC = 0.4 K; TRC

Reduced pressure boiling point

Tboil (K) Pressure (atm) Reference Comment
344.70.013Aldrich Chemical Company Inc., 1990BS
342.20.013Weast and Grasselli, 1989BS

Enthalpy of vaporization

ΔvapH (kcal/mol) Temperature (K) Method Reference Comment
11.5317.AStephenson and Malanowski, 1987Based on data from 302. - 453. K. See also Stull, 1947.; AC

Antoine Equation Parameters

log10(P) = A − (B / (T + C))
    P = vapor pressure (atm)
    T = temperature (K)

View plot Requires a JavaScript / HTML 5 canvas capable browser.

Temperature (K) A B C Reference Comment
302. - 466.4.571631942.838-41.3Stull, 1947Coefficents calculated by NIST from author's data.

In addition to the Thermodynamics Research Center (TRC) data available from this site, much more physical and chemical property data is available from the following TRC products:

Normal alkane RI, polar column, temperature ramp

Data compiled by: NIST Mass Spectrometry Data Center, William E. Wallace, director

Column type CapillaryCapillaryCapillary
Active phase DB-WaxInnowaxInnowax
Column length (m) 60.30.30.
Carrier gas HeN2N2
Substrate
Column diameter (mm) 0.320.250.25
Phase thickness (μm) 0.250.250.25
Tstart (C) 70.50.50.
Tend (C) 220.280.280.
Heat rate (K/min) 4.9.9.
Initial hold (min)  3.3.
Final hold (min)  3.3.
I 1434.1425.1459.
ReferencePala-Paul, Brophy, et al., 2007Abdelwahed, Hayder, et al., 2006Abdelwahed, Hayder, et al., 2006
Comment MSDC-RI MSDC-RI MSDC-RI

References

Albano, Lima, et al., 2012
Albano, S.M.; Lima, A.S.; Miguel, M.G.; Pedro, L.G.; Barroso, J.G.; Figueiredo, A.C., Antioxidant, anti-5-lipoxygenase and antiacetylcholinesterase activities of essential oils and decoction water of some aromatic plants, Rec. Nat. Prod., 2012, 6, 1, 35-48. [all data]

Veres, Csupor-Loffler, et al., 2012
Veres, K.; Csupor-Loffler, B.; Lazar, A.; Holmann, J., Antifungal activity and composition of essential oils of Conyza canadensis herbs and roots, The Sci. World. J., 2012, 2012, 1-5, https://doi.org/10.1100/2012/489646 . [all data]

Mendes, Trindade, et al., 2009
Mendes, M.D.; Trindade, H.; Figueiredo, A.C.; Pedro, L.G.; Barroso, J.G., Chaerophyllum azoricun Trel. grown in the Azores archipelago, Portugal: evaluation of the genetic diversity using molecular markers and comparison with volatile oils profiles, Flavour Fragr. J., 2009, 24, 5, 259-265, https://doi.org/10.1002/ffj.1939 . [all data]

Mendes, Trindade, et al., 2009, 2
Mendes, M.D.; Trindade, H.; Figueiredo, A.C.; Barroso, J.G.; Fontinha, S.S.; Pedro, L.G., Volatile and molecular characterization of two Portuguese endemic species: Angelica lignescens and Melanoselinium decipiens, Biochen. Systematics Ecol., 2009, 37, 2, 98-105, https://doi.org/10.1016/j.bse.2008.12.006 . [all data]

Figueiredo, Sim-Sim, et al., 2005
Figueiredo, A.C.; Sim-Sim, M.; Costa, M.M.; Barroso, J.G.; Pedro, L.G.; Esquível, M.G.; Gutierres, F.; Lobo, C.; Fontinha, S., Comparison of the essential oil composition of four Plagiochila species: P. bifaria, P. maderensis, P. retrorsa and P. stricta, Flavour Fragr. J., 2005, 20, 6, 703-709, https://doi.org/10.1002/ffj.1627 . [all data]

Cornwell and Cordano, 2003
Cornwell, E.; Cordano, G., Nueva proposicion para predecir datos de retencion obtenidos mediante cromatografia de gases de hidrocarburos derivados de las naftas, Revista de la Sociedad Quimica de Mexico, 2003, 47, 1, 38-43. [all data]

Santos, Figueiredo, et al., 1999
Santos, P.A.; Figueiredo, A.C.; Barroso, J.G.; Pedro, L.G.; Scheffer, J.J.C., Composition of the essential oil of Hypericum foliosum Aiton from five Azorean islands, Flavour Fragr. J., 1999, 14, 5, 283-286, https://doi.org/10.1002/(SICI)1099-1026(199909/10)14:5<283::AID-FFJ826>3.0.CO;2-2 . [all data]

Waggott and Davies, 1984
Waggott, A.; Davies, I.W., Identification of organic pollutants using linear temperature programmed retention indices (LTPRIs) - Part II, 1984, retrieved from http://dwi.defra.gov.uk/research/completed-research/reports/dwi0383.pdf. [all data]