Diborane(6)-d6

Phase change data

Data compiled by: William E. Acree, Jr., James S. Chickos

Enthalpy of vaporization

ΔvapH (kcal/mol) Temperature (K) Reference Comment
3.66164.Ditter, Perrine, et al., 1961Based on data from 118. - 179. K.

Gas phase ion energetics data

Data compiled by: Henry M. Rosenstock, Keith Draxl, Bruce W. Steiner, and John T. Herron

Ionization energy determinations

IE (eV) Method Reference
12.0 ± 0.1EIKoski, Kaufman, et al., 1958

Appearance energy determinations

Ion AE (eV) Other Products MethodReferenceComment
B+18.6 ± 0.1?EIKoski, Kaufman, et al., 1958
BD+14.8 ± 0.1?EIKoski, Kaufman, et al., 1958
BD2+13.6 ± 0.1?EIKoski, Kaufman, et al., 1958
BD3+12.7 ± 0.2BD3?EIKoski, Kaufman, et al., 1958
B2+21.8 ± 0.23D2EIKoski, Kaufman, et al., 1958
B2D+18.3 ± 0.12D2+DEIKoski, Kaufman, et al., 1958
B2D2+14.0 ± 0.12D2EIKoski, Kaufman, et al., 1958
B2D3+14.5 ± 0.2D2+DEIFehlner and Koski, 1964
B2D3+14.3 ± 0.1D2+DEIKoski, Kaufman, et al., 1958
B2D4+12.3 ± 0.2D2EIFehlner and Koski, 1964
B2D4+12.3 ± 0.1D2EIKoski, Kaufman, et al., 1958
B2D5+12.0 ± 0.1DEIFehlner and Koski, 1964
B2D5+12.1 ± 0.1DEIKoski, Kaufman, et al., 1958

References

Ditter, Perrine, et al., 1961
Ditter, J.F.; Perrine, J.C.; Shapiro, Isadore, Vapor Pressure of Deuterodiborane., J. Chem. Eng. Data, 1961, 6, 2, 271-271, https://doi.org/10.1021/je60010a026 . [all data]

Koski, Kaufman, et al., 1958
Koski, W.S.; Kaufman, J.J.; Pachucki, C.F.; Shipko, F.J., A mass spectrometric appearance potential study of isotopically labeled diboranes, J. Am. Chem. Soc., 1958, 80, 3202. [all data]

Fehlner and Koski, 1964
Fehlner, T.P.; Koski, W.S., The fragmentation of some boron hydrides by electron impact, J. Am. Chem. Soc., 1964, 86, 581. [all data]