1,1-Dichlorooctane

Phase change data

Data compiled by: William E. Acree, Jr., James S. Chickos

Quantity Value Units Method Reference Comment
Δvap13.8kcal/molAVarushchenko, Loseva, et al., 1987Based on data from 380. - 480. K. See also Basarová and Svoboda, 1991.

References

Varushchenko, Loseva, et al., 1987
Varushchenko, R.M.; Loseva, O.L.; Druzhinina, A.I., Zh. Fiz. Khim., 1987, 61, 638. [all data]

Basarová and Svoboda, 1991
Basarová, Pavlína; Svoboda, Václav, Calculation of heats of vaporization of halogenated hydrocarbons from saturated vapour pressure data, Fluid Phase Equilibria, 1991, 68, 13-34, https://doi.org/10.1016/0378-3812(91)85008-I . [all data]