Toluene-D8

Reaction thermochemistry data

Data compiled by: John E. Bartmess

Individual Reactions

C7D7- + Deuterium cation = Toluene-D8

By formula: C7D7- + D+ = C7D8

Quantity Value Units Method Reference Comment
Δr1616.9 ± 2.8kJ/molG+TSEllison, Davico, et al., 1996gas phase
Quantity Value Units Method Reference Comment
Δr1578.2 ± 1.3kJ/molIMREEllison, Davico, et al., 1996gas phase

Gas phase ion energetics data

Data compiled by: Sharon G. Lias and Joel F. Liebman

Appearance energy determinations

Ion AE (eV) Other Products MethodReferenceComment
C7D7+11.25 ± 0.05DPIPECOLifshitz, 1991T = 0K

Van Den Dool and Kratz RI, non-polar column, temperature ramp

View large format table.

Column type Active phase I Reference Comment
CapillaryPetrocol DH751.6Censullo, Jones, et al., 200350. m/0.25 mm/0.5 μm, He, 35. C @ 10. min, 3. K/min, 200. C @ 10. min
CapillaryDB-5759.Morinaga, Hara, et al., 199015. m/0.53 mm/1.5 μm, He, 4. K/min; Tstart: 40. C; Tend: 90. C

References

Ellison, Davico, et al., 1996
Ellison, G.B.; Davico, G.E.; Bierbaum, V.M.; DePuy, C.H., Thermochemistry of theb Benzyl and Allyl Radicals and Ions, Int. J. Mass Spectrom. Ion Proc., 1996, 156, 1-2, 109-131, https://doi.org/10.1016/S0168-1176(96)04383-2 . [all data]

Lifshitz, 1991
Lifshitz, C., Dissociative photoionization in the vacuum UV region with ion trapping, Int. J. Mass Spectrom. Ion Processes, 1991, 106, 159. [all data]

Censullo, Jones, et al., 2003
Censullo, A.C.; Jones, D.R.; Wills, M.T., Speciation of the volatile organic compounds (VOCs) in solventborne aerosol coatings by solid phase microextraction-gas chromatography, J. Coat. Technol., 2003, 75, 936, 47-53, https://doi.org/10.1007/BF02697922 . [all data]

Morinaga, Hara, et al., 1990
Morinaga, M.; Hara, K.; Kageura, M.; Heida, Y.; Takamoto, M.; Kashimura, S., A simple, rapid and simultaneous analysis of complex volatile hydrocarbon mixtures in blood using gas chromatography/mass spectrometry with a wide-bore capillary column, Z. Rechtsmed., 1990, 103, 8, 567-572, https://doi.org/10.1007/BF01261420 . [all data]