1-Methoxy-3-methyl-d3-benzene

Gas phase ion energetics data

Data compiled by: Henry M. Rosenstock, Keith Draxl, Bruce W. Steiner, and John T. Herron

Appearance energy determinations

Ion AE (eV) Other Products MethodReferenceComment
C8H6D3O+12.1 ± 0.1HEIMeyer and Harrison, 1964
C8H7D2O+12.1 ± 0.1DEIMeyer and Harrison, 1964

References

Meyer and Harrison, 1964
Meyer, F.; Harrison, A.G., An electron impact study of methyl phenyl ethers, Can. J. Chem., 1964, 42, 2008. [all data]