Octanoic acid, 3-methylbutyl ester

Kovats' RI, non-polar column, temperature ramp

Data compiled by: NIST Mass Spectrometry Data Center, William E. Wallace, director

Column type CapillaryCapillaryCapillaryCapillary
Active phase SE-54CP Sil 5 CBDB-1DB-1
Column length (m) 50.25.60.60.
Carrier gas   HeHe
Substrate
Column diameter (mm) 0.210.250.320.32
Phase thickness (μm)   0.250.25
Tstart (C) 80.60.30.30.
Tend (C) 200.280.210.210.
Heat rate (K/min) 2.5.2.2.
Initial hold (min)   4.4.
Final hold (min)
I 1442.1433.1430.1435.
ReferenceJanzanntti, Franco, et al., 2000Kaul and Vats, 1998Takeoka, Buttery, et al., 1992Takeoka, Buttery, et al., 1992
Comment MSDC-RI MSDC-RI MSDC-RI MSDC-RI

Kovats' RI, non-polar column, custom temperature program

Data compiled by: NIST Mass Spectrometry Data Center, William E. Wallace, director

Column type Capillary
Active phase SE-54
Column length (m) 50.
Carrier gas
Substrate
Column diameter (mm) 0.21
Phase thickness (μm)
Program 50C (10min) => 2C/min => 75C => 3C/min => 150C => 5C/min => 200C
I 1452.
ReferenceJanzanntti, Franco, et al., 2000
Comment MSDC-RI

Kovats' RI, polar column, temperature ramp

Data compiled by: NIST Mass Spectrometry Data Center, William E. Wallace, director

Column type Capillary
Active phase Carbowax 20M
Column length (m) 50.
Carrier gas He
Substrate
Column diameter (mm) 0.28
Phase thickness (μm)
Tstart (C) 70.
Tend (C) 190.
Heat rate (K/min) 2.
Initial hold (min)
Final hold (min)
I 1658.
ReferenceTressl, Friese, et al., 1978
Comment MSDC-RI

References

Janzanntti, Franco, et al., 2000
Janzanntti, N.S.; Franco, M.R.B.; Lanças, F.M., Identificação de compostos voláteis de maçãs (Malus domestica) cultivar fuji, por cromatografia gasosa-espectrometria de massas, Cienc. Tecnol. Aliment., 2000, 20, 2, 164-171, retrieved from http://www.scielo.br/scielo.php?script=sciarttextpid=S0101-20612000000200007lng=ptnrm=iso. [all data]

Kaul and Vats, 1998
Kaul, V.K.; Vats, S.K., Essential oil composition of Bothriochloa pertusa and phyletic relationship in aromatic grasses, Biochem. Syst. Ecol., 1998, 26, 3, 347-356, https://doi.org/10.1016/S0305-1978(97)00103-8 . [all data]

Takeoka, Buttery, et al., 1992
Takeoka, G.R.; Buttery, R.G.; Flath, R.A., Volatile constituents of Asian pear (Pyrus serotina), J. Agric. Food Chem., 1992, 40, 10, 1925-1929, https://doi.org/10.1021/jf00022a040 . [all data]