1H-Phosphole,1-phenyl-

Gas phase ion energetics data

Data compiled by: Sharon G. Lias, Rhoda D. Levin, and Sherif A. Kafafi

Ionization energy determinations

IE (eV) Method Reference Comment
8.45PESchafer, Schweig, et al., 1973Vertical value

References

Schafer, Schweig, et al., 1973
Schafer, W.; Schweig, A.; Markl, G.; Hauptmann, H.; Mathey, F., Direct proof of the non-aromaticity of phospholes and arsoles, Angew. Chem. Int. Ed. Engl., 1973, 12, 145. [all data]