Ethane, 2-bromo-1,1-diethoxy-

Kovats' RI, non-polar column, isothermal

View large format table.

Column type Active phase Temperature (C) I Reference Comment
PackedSilicon High Vacuum Grease (obsolete)90.1005.Jonas, Janák, et al., 1966H2

References

Jonas, Janák, et al., 1966
Jonas, J.; Janák, J.; Kratochvíl, M., Structural investigations with the aid of Kovats retention index system on one (nonpolar) stationary phase, J. Gas Chromatogr., 1966, 4, 9, 332-335, https://doi.org/10.1093/chromsci/4.9.332 . [all data]