Ethane-1,1,1-d3

Gas phase ion energetics data

Data compiled as indicated in comments:
LLK - Sharon G. Lias, Rhoda D. Levin, and Sherif A. Kafafi
RDSH - Henry M. Rosenstock, Keith Draxl, Bruce W. Steiner, and John T. Herron

Ionization energy determinations

IE (eV) Method Reference Comment
11.5 ± 0.1EISuzuki and Maeda, 1977LLK
11.78 ± 0.03EID'Or, Collin, et al., 1966RDSH

Appearance energy determinations

Ion AE (eV) Other Products MethodReferenceComment
CD3+15.10 ± 0.10CH3EID'Or, Collin, et al., 1966RDSH
CHD2+14.97 ± 0.10CH2DEID'Or, Collin, et al., 1966RDSH
CH2D+14.94 ± 0.14CHD2EID'Or, Collin, et al., 1966RDSH
CH3+15.15?EID'Or, Collin, et al., 1966RDSH
C2HD+15.50 ± 0.10?EID'Or, Collin, et al., 1966RDSH
C2HD3+12.81 ± 0.01H2EID'Or, Collin, et al., 1966RDSH
C2H2D+15.5 ± 0.1?EID'Or, Collin, et al., 1966RDSH
C2H2D2+12.35 ± 0.06HDEID'Or, Collin, et al., 1966RDSH
C2H2D3+12.2 ± 0.1HEISuzuki and Maeda, 1977LLK
C2H2D3+12.52 ± 0.08HEID'Or, Collin, et al., 1966RDSH
C2H3D+12.75 ± 0.10D2EID'Or, Collin, et al., 1966RDSH
HD+38.2 ± 0.8?EISuzuki and Maeda, 1977LLK
D2+35.2 ± 0.8?EISuzuki and Maeda, 1977LLK

Vibrational and/or electronic energy levels

Data compiled by: Takehiko Shimanouchi

Symmetry:   C     Symmetry Number σ = 3

 Sym.   No   Approximate   Selected Freq.  Infrared   Raman   Comments
 Species   type of mode   Value   Rating   Value  Phase  Value  Phase

a1 1 CH3 s-str 2912  E 2955.1 S gas 2955.5 gas FR(2ν9)
a1 1 CH3 s-str 2912  E 2897.4 S gas 2898.2 gas FR(2ν9)
a1 2 CD3 s-str 2098  E 2139.6 S gas FR(2ν11)
a1 2 CD3 s-str 2098  E 2089.7 S gas FR(2ν11)
a1 3 CH3 s-deform 1387  B 1386.6 W gas
a1 4 CD3 s-deform 1122  B 1122.0 W gas
a1 5 CC str 904  A 903.8 VW gas 904.7 gas
a2 6 Torsion 253  B 253 VW gas
e 7 CH3 d-str 2977  D 2976.5 S gas 2976.6 gas
e 8 CD3 d-str 2240  E 2240 S gas
e 9 CH3 d-deform 1471  A 1471.1 M gas
e 10 CH3 rock 1115  B 1115.0 W gas
e 11 CD3 d-deform 1066  B 1065.7 M gas 1062.6 gas
e 12 CD3 rock 678  A 678.4 M gas

Source: Shimanouchi, 1972

References

Suzuki and Maeda, 1977
Suzuki, I.H.; Maeda, K., Ionization efficiency curves of ethane by electron impact, Int. J. Mass Spectrom. Ion Phys., 1977, 24, 147. [all data]

D'Or, Collin, et al., 1966
D'Or, L.; Collin, J.E.; Longree, J., Ionisation et dissociation de l'ethane sous l'impact electronique. Spectres de masse et phenomenes d'echange dans C2H6, C2H5D, CH3CD3 et C2D6, Bull. Classe Sci. Acad. Roy. Belg., 1966, 52, 518. [all data]

Shimanouchi, 1972
Shimanouchi, T., Tables of Molecular Vibrational Frequencies Consolidated Volume I, National Bureau of Standards, 1972, 1-160. [all data]