Pentane-d12

Phase change data

Data compiled by: William E. Acree, Jr., James S. Chickos

Quantity Value Units Method Reference Comment
Δvap6.21kcal/molN/AHörner, Höpfner, et al., 2010Based on data from 205. - 298. K.

Gas phase ion energetics data

Data compiled as indicated in comments:
LBLHLM - Sharon G. Lias, John E. Bartmess, Joel F. Liebman, John L. Holmes, Rhoda D. Levin, and W. Gary Mallard
LLK - Sharon G. Lias, Rhoda D. Levin, and Sherif A. Kafafi

Ionization energy determinations

IE (eV) Method Reference Comment
10.29 ± 0.10EQLias, 1982LBLHLM
10.19 ± 0.15EQMautner(Meot-Ner), Sieck, et al., 1981LLK

References

Hörner, Höpfner, et al., 2010
Hörner, Ch.; Höpfner, A.; Schmeiser, B., Der Dampfdruck-Isotopie-Effekt von deuterierten n-Pentanen, Berichte der Bunsengesellschaft für physikalische Chemie, 2010, 79, 2, 222-225, https://doi.org/10.1002/bbpc.19750790218 . [all data]

Lias, 1982
Lias, S.G., Thermochemical information from ion-molecule rate constants, Ion Cyclotron Reson. Spectrom. 1982, 1982, 409. [all data]

Mautner(Meot-Ner), Sieck, et al., 1981
Mautner(Meot-Ner), M.; Sieck, L.W.; Ausloos, P., Ionization of normal alkanes: Enthalpy, entropy, structural, and isotope effects, J. Am. Chem. Soc., 1981, 103, 5342. [all data]