Dibenzo[j,l]fluoranthene

Lee's RI, non-polar column, temperature ramp

Data compiled by: NIST Mass Spectrometry Data Center, William E. Wallace, director

Column type CapillaryCapillary
Active phase DB-5MSXTI-5
Column length (m) 30.15.
Carrier gas  H2
Substrate
Column diameter (mm) 0.250.28
Phase thickness (μm) 0.250.25
Tstart (C) 60.70.
Tend (C) 320.350.
Heat rate (K/min) 5.5.
Initial hold (min) 3.2.
Final hold (min) 20.
I 542.2534.48
ReferenceSauvain and Duc, 2004Engkvist, Borowski, et al., 1996
Comment MSDC-RI MSDC-RI

References

Sauvain and Duc, 2004
Sauvain, J.-J.; Duc, T.V., Approaches to identifying and quantifying polycyclic aromatic hydrocarbons of molecular weight 302 in diesel particulates, J. Sep. Sci., 2004, 27, 1-2, 78-88, https://doi.org/10.1002/jssc.200301620 . [all data]

Engkvist, Borowski, et al., 1996
Engkvist, O.; Borowski, P.; Bemgård, A.; Karlström, G.; Lindh, R.; Colmsjö, A., On the relation between retention indexes and the interaction between the solute and the column in gas-liquid chromatography, J. Chem. Inf. Comput. Sci., 1996, 36, 6, 1153-1161, https://doi.org/10.1021/ci960345u . [all data]