Hexane, 1-(methylthio)-

Van Den Dool and Kratz RI, non-polar column, temperature ramp

Data compiled by: NIST Mass Spectrometry Data Center, William E. Wallace, director

Column type CapillaryCapillary
Active phase HP-5HP-5
Column length (m) 25.25.
Carrier gas HeHe
Substrate
Column diameter (mm) 0.20.2
Phase thickness (μm) 1.1.
Tstart (C) 40.40.
Tend (C) 280.280.
Heat rate (K/min) 5.5.
Initial hold (min)
Final hold (min) 5.5.
I 1004.1004.
ReferenceSolina, Baumgartner, et al., 2005Solina, Baumgartner, et al., 2005
Comment MSDC-RI MSDC-RI

References

Solina, Baumgartner, et al., 2005
Solina, M.; Baumgartner, P.; Johnson, R.L.; Whitfield, F.B., Volatile aroma components of soy protein isolate and acid-hydrolysed vegetable protein, Food Chem., 2005, 90, 4, 861-873, https://doi.org/10.1016/j.foodchem.2004.06.005 . [all data]