Butanoic acid, 2-octyl ester

Kovats' RI, polar column, isothermal

Data compiled by: NIST Mass Spectrometry Data Center, William E. Wallace, director

Column type Packed
Active phase Carbowax 20M
Column length (m) 2.
Carrier gas
Substrate Chromosorb W
Column diameter (mm)
Phase thickness (μm)
Temperature (C) 140.
I 1507.
ReferenceZarazir, Chovin, et al., 1970
Comment MSDC-RI

Phase change data

Data compiled by: Thermodynamics Research Center, NIST Boulder Laboratories, Chris Muzny director

Quantity Value Units Method Reference Comment
Tboil492.KN/AMusaev, Mekhtiev, et al., 1967Uncertainty assigned by TRC = 5. K

In addition to the Thermodynamics Research Center (TRC) data available from this site, much more physical and chemical property data is available from the following TRC products:

Kovats' RI, non-polar column, isothermal

View large format table.

Column type Active phase Temperature (C) I Reference Comment
PackedSE-30140.1298.Zarazir, Chovin, et al., 1970Chromosorb W; Column length: 2. m

References

Zarazir, Chovin, et al., 1970
Zarazir, D.; Chovin, P.; Guiochon, G., Identification of hydroxylic compounds and their derivatives by gas chromatography, Chromatographia, 1970, 3, 4, 180-195, https://doi.org/10.1007/BF02269018 . [all data]