2-Penten-1-ol

Van Den Dool and Kratz RI, polar column, temperature ramp

Data compiled by: NIST Mass Spectrometry Data Center, William E. Wallace, director

Column type CapillaryCapillaryCapillaryCapillary
Active phase DB-WaxDB-WaxDB-WaxDB-Wax
Column length (m) 60.30.60.60.
Carrier gas He  He
Substrate
Column diameter (mm) 0.320.320.250.25
Phase thickness (μm) 0.50.50.250.25
Tstart (C) 30.40.50.50.
Tend (C) 160.245.230.230.
Heat rate (K/min) 3.3.2.2.
Initial hold (min)  3.
Final hold (min) 5.20.
I 1361.1315.1324.1324.
ReferenceBeauchene, Grua-Priol, et al., 2000Ollé, Baumes, et al., 1998Shimoda, Shigematsu, et al., 1995Shimoda, Shigematsu, et al., 1995, 2
Comment MSDC-RI MSDC-RI MSDC-RI MSDC-RI

References

Beauchene, Grua-Priol, et al., 2000
Beauchene, D.; Grua-Priol, J.; Lamer, T.; Demaimay, M.; Quemeneur, F., Concentration by pervaporation of aroma compounds from Fucus serratus, J. Sci. Food Agric., 2000, 75, 451-458. [all data]

Ollé, Baumes, et al., 1998
Ollé, D.; Baumes, R.L.; Bayonove, C.L.; Lozano, Y.F.; Sznaper, C.; Brillouet, J.-M., Comparison of free and glycosidically linked volatile components from polyembryonic and monoembryonic mango (Mangifera indica L.) cultivars, J. Agric. Food Chem., 1998, 46, 3, 1094-1100, https://doi.org/10.1021/jf9705781 . [all data]

Shimoda, Shigematsu, et al., 1995
Shimoda, M.; Shigematsu, H.; Shiratsuchi, H.; Osajima, Y., Comparison of the odor concentrates by SDE and adsorptive column method from green tea infusion, J. Agric. Food Chem., 1995, 43, 6, 1616-1620, https://doi.org/10.1021/jf00054a037 . [all data]

Shimoda, Shigematsu, et al., 1995, 2
Shimoda, M.; Shigematsu, H.; Shiratsuchi, H.; Osajima, Y., Comparison of volatile compounds among different grades of green tea and their relations to odor attributes, J. Agric. Food Chem., 1995, 43, 6, 1621-1625, https://doi.org/10.1021/jf00054a038 . [all data]