HCl3Sn

Reaction thermochemistry data

Data compiled by: John E. Bartmess

Individual Reactions

Cl3Sn- + Hydrogen cation = HCl3Sn

By formula: Cl3Sn- + H+ = HCl3Sn

Quantity Value Units Method Reference Comment
Δr1208.3kJ/molN/ACheck, Faust, et al., 2001gas phase; NiCl3-; ; ΔS(EA)=4.9
Quantity Value Units Method Reference Comment
Δr1173.2kJ/molN/ACheck, Faust, et al., 2001gas phase; NiCl3-; ; ΔS(EA)=4.9

References

Check, Faust, et al., 2001
Check, C.E.; Faust, T.O.; Bailey, J.M.; Wright, B.J.; Gilbert, T.M.; Sunderlin, L.S., Addition of Polarization and Diffuse Functions to the LANL2DZ Basis Set for P-Block Elements, J. Phys. Chem. A,, 2001, 105, 34, 8111, https://doi.org/10.1021/jp011945l . [all data]