3,5,7,9-Dodecatetrayne, 2,2,11,11-tetramethyl-

Gas phase ion energetics data

Data compiled by: Sharon G. Lias, Rhoda D. Levin, and Sherif A. Kafafi

Ionization energy determinations

IE (eV) Method Reference Comment
8.12 ± 0.02PEHeilbronner, Jones, et al., 1978Vertical value

References

Heilbronner, Jones, et al., 1978
Heilbronner, E.; Jones, T.B.; Kloster-Jensen, E.; Maier, J.P., 191. Electronic states of di-t-butylpolyacetylene radical cations, Helv. Chim. Acta, 1978, 61, 2040. [all data]

Christen and Kloster-Jensen, 1973
Christen, H.; Kloster-Jensen, E., Helv. Chim. Acta, 1973, 56, 1752. [all data]