Guaioxide

Normal alkane RI, non-polar column, temperature ramp

Data compiled by: NIST Mass Spectrometry Data Center, William E. Wallace, director

Column type CapillaryCapillary
Active phase BPX5BPX-5
Column length (m) 25.25.
Carrier gas HeliumHe
Substrate
Column diameter (mm) 0.220.22
Phase thickness (μm) 0.250.25
Tstart (C) 50.50.
Tend (C) 320.320.
Heat rate (K/min) 5.5.
Initial hold (min) 5.5.
Final hold (min)
I 1521.1516.
ReferenceDickschat, Bode, et al., 2005Dickschat, Martens, et al., 2005
Comment MSDC-RI MSDC-RI

References

Dickschat, Bode, et al., 2005
Dickschat, J.S.; Bode, H.B.; Wenzel, S.C.; Muller, R.; Schulz, S., Biosinthesis and Identification of Volatiles Released by the Myxobacterium Stigmatella aurantiaca, ChemBioChem, 2005, 6, 11, 2023-2033, https://doi.org/10.1002/cbic.200500174 . [all data]

Dickschat, Martens, et al., 2005
Dickschat, J.S.; Martens, T.; Brinkhoff, T.; Simon, M.; Schulz, S., Volatiles released by a Streptomyces species isolated from the North Sea, Chemistry and Biodiversity, 2005, 2, 7, 837-865, https://doi.org/10.1002/cbdv.200590062 . [all data]