Methanone, (2-amino-5-nitrophenyl)(2-chlorophenyl)-

Kovats' RI, non-polar column, isothermal

View large format table.

Column type Active phase Temperature (C) I Reference Comment
CapillarySPB-1250.2494.Lora-Tamayo, Rams, et al., 1986He; Column length: 25. m; Column diameter: 0.20 mm

Kovats' RI, non-polar column, temperature ramp

View large format table.

Column type Active phase I Reference Comment
PackedOV-1012470.Maurer, 1990N2, Chromosorb G HP, 100. C @ 3. min, 30. K/min, 310. C @ 5. min; Column length: 0.6 m
CapillaryCross-Linked Methylsilicone2470.Maurer and Pfleger, 198712. m/0.2 mm/0.33 μm, He, 100. C @ 3. min, 30. K/min, 310. C @ 5. min
CapillaryCross-Linked Methylsilicone2470.Maurer and Pfleger, 198712. m/0.2 mm/0.33 μm, He, 100. C @ 3. min, 30. K/min, 310. C @ 5. min

Normal alkane RI, non-polar column, custom temperature program

View large format table.

Column type Active phase I Reference Comment
CapillaryHP-5MS2470.Augsburger, Rivier, et al., 199830. m/0.25 mm/0.25 μm; Program: not specified
OtherMethyl Silicone2516.Ardrey and Moffat, 1981Program: not specified

References

Lora-Tamayo, Rams, et al., 1986
Lora-Tamayo, C.; Rams, M.A.; Chacon, J.M.R., Gas Chromatographic Data for 187 Nitrogen- or Phosphorus-Containing Drugs and Metabolites of Toxicological Interest Analysed on Methyl Silicone Capillary Columns, J. Chromatogr., 1986, 374, 73-85, https://doi.org/10.1016/S0378-4347(00)83254-5 . [all data]

Maurer, 1990
Maurer, H.H., Detection of anticonvulsants and their metabolites in urine within a general unknown analysis procedure using computerized gas chromatography-mass spectrometry, Arch. Toxicol., 1990, 64, 7, 554-561, https://doi.org/10.1007/BF01971834 . [all data]

Maurer and Pfleger, 1987
Maurer, H.; Pfleger, K., Identification and differentiation of benzodiazepines and their metabolites in urine by computerized gas chromatography-mass spectrometry, J. Chromatogr., 1987, 422, 85-101, https://doi.org/10.1016/0378-4347(87)80442-5 . [all data]

Augsburger, Rivier, et al., 1998
Augsburger, M.; Rivier, L.; Mangin, P., Comparison of different immunoassays and GC-MS screening of benzodiazepines in urine, J. Pharm. Biomed. Anal., 1998, 18, 4-5, 681-687, https://doi.org/10.1016/S0731-7085(98)00266-0 . [all data]

Ardrey and Moffat, 1981
Ardrey, R.E.; Moffat, A.C., Gas-liquid chromatographic retention indices of 1318 substances of toxicological interest on SE-30 or OV-1 stationary phase, J. Chromatogr., 1981, 220, 3, 195-252, https://doi.org/10.1016/S0021-9673(00)81925-1 . [all data]