Epicurzerenone

Kovats' RI, non-polar column, temperature ramp

View large format table.

Column type Active phase I Reference Comment
CapillaryBP-11584.Srivastava, Srivastava, et al., 200630. m/0.32 mm/0.25 μm, N2, 5. K/min, 220. C @ 3. min; Tstart: 60. C
CapillaryBP-11584.Raina, Srivastava, et al., 200225. m/0.55 mm/0.25 μm, N2, 5. K/min, 220. C @ 15. min; Tstart: 60. C
CapillaryMethyl Silicone1601.9Rao, Rajanikanth, et al., 19894. K/min, 250. C @ 15. min; Column length: 12. m; Column diameter: 0.5 mm; Tstart: 70. C

Van Den Dool and Kratz RI, non-polar column, custom temperature program

View large format table.

Column type Active phase I Reference Comment
CapillaryHP-5MS1623.2Andriamaharavo, 201430. m/0.25 mm/0.25 μm, He; Program: 60C (1 min) => 5 C/min => 210C => 10 C/min => 280C (15 min)

Normal alkane RI, polar column, temperature ramp

View large format table.

Column type Active phase I Reference Comment
CapillaryCP-Wax 52CB2219.Mau, Lai, et al., 200360. m/0.25 mm/0.25 μm, He, 3. K/min; Tstart: 40. C; Tend: 220. C

References

Srivastava, Srivastava, et al., 2006
Srivastava, A.K.; Srivastava, S.K.; Syamsundar, K.V., Volatile composition of Curcuma angustifolia Roxb. rhizome from central and southern India, Flavour Fragr. J., 2006, 21, 3, 423-426, https://doi.org/10.1002/ffj.1680 . [all data]

Raina, Srivastava, et al., 2002
Raina, V.K.; Srivastava, S.K.; Jain, N.; Ahmad, A.; Syamasundar, K.V.; Aggarwal, K.K., Essential oil composition of Curcuma longa L. cv. Roma from the plains of northern India, Flavour Fragr. J., 2002, 17, 2, 99-102, https://doi.org/10.1002/ffj.1053 . [all data]

Rao, Rajanikanth, et al., 1989
Rao, A.S.; Rajanikanth, B.; Seshadri, R., Volatile aroma components of Curcuma amada Roxb., J. Agric. Food Chem., 1989, 37, 3, 740-743, https://doi.org/10.1021/jf00087a036 . [all data]

Andriamaharavo, 2014
Andriamaharavo, N.R., Retention Data. NIST Mass Spectrometry Data Center., NIST Mass Spectrometry Data Center, 2014. [all data]

Mau, Lai, et al., 2003
Mau, J.-L.; Lai, E.Y.C.; Wang, N.-P.; Chen, C.-C.; Chang, C.-H.; Chyau, C.-C., Composition and antioxidant activity of the essential oil from Curcuma zedoaria, Food Chem., 2003, 82, 4, 583-591, https://doi.org/10.1016/S0308-8146(03)00014-1 . [all data]