1,1,1,2-Tetrafluoro-2-(trifluoromethoxy)butane

Phase change data

Data compiled by: William E. Acree, Jr., James S. Chickos

Quantity Value Units Method Reference Comment
Δvap30.3kJ/molIMurata, Yamashita, et al., 2002Based on data from 283. - 319. K.

References

Murata, Yamashita, et al., 2002
Murata, Junji; Yamashita, Shiro; Akiyama, Minoru; Katayama, Shinichiro; Hiaki, Toshihiko; Sekiya, Akira, Vapor Pressures of Hydrofluoroethers, J. Chem. Eng. Data, 2002, 47, 4, 911-915, https://doi.org/10.1021/je010322y . [all data]