Benzene, 1-ethyl-4-propyl-

Phase change data

Data compiled by: Thermodynamics Research Center, NIST Boulder Laboratories, Chris Muzny director

Quantity Value Units Method Reference Comment
Tboil473.KN/ABecke, 1890Uncertainty assigned by TRC = 6. K

In addition to the Thermodynamics Research Center (TRC) data available from this site, much more physical and chemical property data is available from the following TRC products:

Kovats' RI, non-polar column, isothermal

View large format table.

Column type Active phase Temperature (C) I Reference Comment
CapillarySqualane100.1127.Nabivach and Vasiliev, 1987
CapillaryOV-101100.1142.Gerasimenko and Nabivach, 1982N2; Column length: 50. m; Column diameter: 0.30 mm
CapillaryOV-101120.1146.Gerasimenko and Nabivach, 1982N2; Column length: 50. m; Column diameter: 0.30 mm
CapillaryOV-101140.1150.Gerasimenko and Nabivach, 1982N2; Column length: 50. m; Column diameter: 0.30 mm
CapillarySqualane86.1121.9Macák, Nabivach, et al., 1982N2; Column length: 50. m; Column diameter: 0.25 mm
CapillarySqualane96.1125.2Macák, Nabivach, et al., 1982N2; Column length: 50. m; Column diameter: 0.25 mm
CapillaryOV-101100.1141.9Gerasimenko, Kirilenko, et al., 1981N2; Column length: 50. m; Column diameter: 0.3 mm
CapillaryOV-101120.1146.0Gerasimenko, Kirilenko, et al., 1981N2; Column length: 50. m; Column diameter: 0.3 mm
CapillaryOV-101140.1150.0Gerasimenko, Kirilenko, et al., 1981N2; Column length: 50. m; Column diameter: 0.3 mm
CapillarySqualane86.1121.9Nabivach, Bur'yan, et al., 1978Column length: 50. m; Column diameter: 0.25 mm
CapillarySqualane96.1125.2Nabivach, Bur'yan, et al., 1978Column length: 50. m; Column diameter: 0.25 mm
CapillarySqualane100.1126.Engewald and Wennrich, 1976N2; Column length: 100. m; Column diameter: 0.23 mm

Kovats' RI, polar column, isothermal

View large format table.

Column type Active phase Temperature (C) I Reference Comment
CapillaryCarbowax 20M100.1374.1Engewald and Wennrich, 1976N2; Column length: 100. m; Column diameter: 0.23 mm
CapillaryCarbowax 20M90.1353.4Döring, Estel, et al., 1974Column length: 100. m; Column diameter: 0.2 mm

Normal alkane RI, non-polar column, isothermal

View large format table.

Column type Active phase Temperature (C) I Reference Comment
CapillaryMethyl Silicone120.1146.Chen and Feng, 2006

Normal alkane RI, non-polar column, custom temperature program

View large format table.

Column type Active phase I Reference Comment
CapillarySE-301134.Xiuhua, Zhang, et al., 1996Program: not specified

Normal alkane RI, polar column, isothermal

View large format table.

Column type Active phase Temperature (C) I Reference Comment
CapillaryCarbowax 20M90.1353.Sutter, Peterson, et al., 1997

Normal alkane RI, polar column, custom temperature program

View large format table.

Column type Active phase I Reference Comment
CapillaryCarbowax 20M1353.Ivanciuc, Ivanciuc, et al., 2001Program: not specified

References

Becke, 1890
Becke, Ber. Dtsch. Chem. Ges., 1890, 23, 3191. [all data]

Nabivach and Vasiliev, 1987
Nabivach, V.M.; Vasiliev, E.E.E., Correlation dependencies of GC retention indices from physical chemical properties and structures of aromatic hydrocarbons, Izv. Vyssh. Uchebn. Zaved. Khim. Khim. Tekhnol., 1987, 30, 72-75. [all data]

Gerasimenko and Nabivach, 1982
Gerasimenko, V.A.; Nabivach, V.M., Relationship between molecular structure and gas chromatographic retention of alkylbenzenes C8-C1 2 on polydimethylsiloxane, Zh. Anal. Khim., 1982, 37, 110-116. [all data]

Macák, Nabivach, et al., 1982
Macák, J.; Nabivach, V.; Buryan, P.; Sindler, S., Dependence of retention indices of alkylbenzenes on their molecular structure, J. Chromatogr., 1982, 234, 2, 285-302, https://doi.org/10.1016/S0021-9673(00)81867-1 . [all data]

Gerasimenko, Kirilenko, et al., 1981
Gerasimenko, V.A.; Kirilenko, A.V.; Nabivach, V.M., Capillary gas chromatography of aromatic compounds found in coal tar fractions, J. Chromatogr., 1981, 208, 1, 9-16, https://doi.org/10.1016/S0021-9673(00)87953-4 . [all data]

Nabivach, Bur'yan, et al., 1978
Nabivach, V.M.; Bur'yan, P.; Matsak, I., Retention indices of aromatic hydrocarbons on a squalane capillary column, Zh. Anal. Khim., 1978, 33, 7, 1108-1113. [all data]

Engewald and Wennrich, 1976
Engewald, W.; Wennrich, L., Molekülstruktur und Retentionsverhalten. VIII. Zum Retentionsverhalten höherer Alkylbenzole bei der Gas-Verteilungs-Chromatographie, Chromatographia, 1976, 9, 11, 540-547, https://doi.org/10.1007/BF02275960 . [all data]

Döring, Estel, et al., 1974
Döring, C.E.; Estel, D.; Fischer, R., Kapillar-gaschromatographische Charakterisierung von C10-bis C12-Aromaten, J. Prakt. Chem., 1974, 316, 1, 1-12, https://doi.org/10.1002/prac.19743160102 . [all data]

Chen and Feng, 2006
Chen, Y.; Feng, C.-I., Regerating the spent metal-contaminated cracking catalyst by ozalic acid, J. Shanxi Univ. (Nat. Sci. Ed.), 2006, 29, 4, 414-420. [all data]

Xiuhua, Zhang, et al., 1996
Xiuhua, Zh.; Zhang, L.; Che, X., Prediction of the Kovats retention indexes of polysubstituted alkylbenzenes, Chin. J. Chromatogr., 1996, 14, 4, 244-248. [all data]

Sutter, Peterson, et al., 1997
Sutter, J.M.; Peterson, T.A.; Jurs, P.C., Prediction of gas chromatographic retention indices of alkylbenzenes, Anal. Chim. Acta., 1997, 342, 2-3, 113-122, https://doi.org/10.1016/S0003-2670(96)00578-8 . [all data]

Ivanciuc, Ivanciuc, et al., 2001
Ivanciuc, O.; Ivanciuc, T.; Klein, D.J.; Seitz, W.A.; Balaban, A.T., Quantitative structure-retention relationships for gas chromatographic retention indices of alkylbenzenes with molecular graph descriptors, SAR QSAR Environ. Res., 2001, 11, 5-6, 419-452, https://doi.org/10.1080/10629360108035362 . [all data]