2-Chloro-4-fluorophenol

Van Den Dool and Kratz RI, non-polar column, temperature ramp

View large format table.

Column type Active phase I Reference Comment
CapillaryVF-5MS995.N/A30. m/0.25 mm/0.25 μm, He; Tstart: 60. C; Tend: 270. C
CapillaryOV-1965.4Gautzsch and Zinn, 19968. K/min; Tstart: 35. C; Tend: 300. C

Phase change data

Data compiled by: Robert L. Brown and Stephen E. Stein

Reduced pressure boiling point

Tboil (K) Pressure (bar) Reference
361.20.005Aldrich Chemical Company Inc., 1990

References

Gautzsch and Zinn, 1996
Gautzsch, R.; Zinn, P., Use of incremental models to estimate the retention indexes of aromatic compounds, Chromatographia, 1996, 43, 3/4, 163-176, https://doi.org/10.1007/BF02292946 . [all data]