Thiazole, 5-ethyl-2-methyl-

Kovats' RI, non-polar column, isothermal

Data compiled by: NIST Mass Spectrometry Data Center, William E. Wallace, director

Column type CapillaryCapillaryCapillaryPacked
Active phase OV-101OV-101OV-101Apiezon L
Column length (m) 50.50.50.2.5
Carrier gas HeHeHe
Substrate    Chromosorb GAW
Column diameter (mm) 0.300.300.30
Phase thickness (μm)  0.40.40
Temperature (C) 110.110.110.100.
I 1010.970.1010.1000.
ReferenceGolovnya, Shenderyuk, et al., 1991Golovnya, Zhuravleva, et al., 1991Zhuravleva, Shenderyuk, et al., 1990Yakush, Golovnya, et al., 1986
Comment MSDC-RI MSDC-RI MSDC-RI MSDC-RI

Kovats' RI, polar column, isothermal

Data compiled by: NIST Mass Spectrometry Data Center, William E. Wallace, director

Column type CapillaryCapillary
Active phase PEG-40MPEG-40M
Column length (m) 50.50.
Carrier gas HeHe
Substrate
Column diameter (mm) 0.300.30
Phase thickness (μm)  0.40
Temperature (C) 110.110.
I 1403.1403.
ReferenceGolovnya, Shenderyuk, et al., 1991Zhuravleva, Shenderyuk, et al., 1990
Comment MSDC-RI MSDC-RI

References

Golovnya, Shenderyuk, et al., 1991
Golovnya, R.V.; Shenderyuk, V.V.; Zhuravleva, I.L.; Yakush, E.V., Analogy of sorption properties of alkylthiazoles and alkyl-oxazoles and its use for the calculation of retention indexes in capillary gas chromatography, Zh. Anal. Khim., 1991, 46, 2, 313-319. [all data]

Golovnya, Zhuravleva, et al., 1991
Golovnya, R.V.; Zhuravleva, I.L.; Yakush, E.V.; Schenderjuk, V.V., Retentions of alkyloxazoles and alkythiazoles and their prediction based on non-linear additivity concepts in gas chromatography, J. Chromatogr., 1991, 552, 1-12, https://doi.org/10.1016/S0021-9673(01)95918-7 . [all data]

Zhuravleva, Shenderyuk, et al., 1990
Zhuravleva, I.L.; Shenderyuk, V.V.; Yakush, E.V.; Golovnya, R.V., Calculation of retention indexes of alkyloxazoles and alkylthiazoles in capillary chromatography, Bull. Acad. Sci. USSR, Div. Chem. Sci. (Engl. Transl.), 1990, 6, 6, 1204-1210, https://doi.org/10.1007/BF00962384 . [all data]

Yakush, Golovnya, et al., 1986
Yakush, E.V.; Golovnya, R.V.; Zhuravleva, I.L.; Grigor'eva, D.N., Thermodynamic criterion and its use for identification of alkylthiazols from gas chromatographic data, Zh. Anal. Khim., 1986, 41, 884-889. [all data]