2-Propanamine, N-ethyl-

Phase change data

Data compiled as indicated in comments:
TRC - Thermodynamics Research Center, NIST Boulder Laboratories, Chris Muzny director
AC - William E. Acree, Jr., James S. Chickos

Quantity Value Units Method Reference Comment
Tboil342.8KN/AMajer and Svoboda, 1985
Tboil355.15KN/ACope, Lebel, et al., 1957Uncertainty assigned by TRC = 1.5 K; TRC
Quantity Value Units Method Reference Comment
Tc508.KN/AMajer and Svoboda, 1985
Quantity Value Units Method Reference Comment
Δvap7.947kcal/molN/AMajer and Svoboda, 1985
Δvap7.91 ± 0.02kcal/molCPetros, Majer, et al., 1979AC

Enthalpy of vaporization

ΔvapH (kcal/mol) Temperature (K) Method Reference Comment
7.156342.8N/AMajer and Svoboda, 1985
7.67 ± 0.02313.CPetros, Majer, et al., 1979AC
7.41 ± 0.02328.CPetros, Majer, et al., 1979AC
6.88 ± 0.02358.CPetros, Majer, et al., 1979AC
7.98318.EBPetros, Majer, et al., 1979Based on data from 303. - 342. K.; AC

Enthalpy of vaporization

ΔvapH = A exp(-βTr) (1 − Tr)β
    ΔvapH = Enthalpy of vaporization (at saturation pressure) (kcal/mol)
    Tr = reduced temperature (T / Tc)

View plot Requires a JavaScript / HTML 5 canvas capable browser.

Temperature (K) A (kcal/mol) β Tc (K) Reference Comment
298. - 358.12.490.3098508.Majer and Svoboda, 1985

In addition to the Thermodynamics Research Center (TRC) data available from this site, much more physical and chemical property data is available from the following TRC products:

Reaction thermochemistry data

Data compiled by: Hussein Y. Afeefy, Joel F. Liebman, and Stephen E. Stein

Individual Reactions

Hydrogen + (E)-N-Isopropylacetaldimine = 2-Propanamine, N-ethyl-

By formula: H2 + C5H11N = C5H13N

Quantity Value Units Method Reference Comment
Δr21.9 ± 0.98kcal/molChydHafelinger and Steinmann, 1977liquid phase; solvent: Acetic acid

References

Majer and Svoboda, 1985
Majer, V.; Svoboda, V., Enthalpies of Vaporization of Organic Compounds: A Critical Review and Data Compilation, Blackwell Scientific Publications, Oxford, 1985, 300. [all data]

Cope, Lebel, et al., 1957
Cope, A.C.; Lebel, N.A.; Lee, H.-H.; Moore, W.R., Amine oxides: III selective formation of olefins from unsymmetrical amine oxides and quaternary ammonium hydroxides, J. Am. Chem. Soc., 1957, 79, 4720. [all data]

Petros, Majer, et al., 1979
Petros, Libor; Majer, Vladimír; Koubek, Josef; Svoboda, Václav; Pick, Jirí, Temperature dependence of heats of vaporization, saturated vapour pressures and cohesive energies of secondary amines, Collect. Czech. Chem. Commun., 1979, 44, 12, 3533-3540, https://doi.org/10.1135/cccc19793533 . [all data]

Hafelinger and Steinmann, 1977
Hafelinger, G.; Steinmann, L., Heat of hydrogenation of compounds containing isolated and conjugted C=N bouble bonds, Angew. Chem. Int. Ed. Engl., 1977, 16, 47-48. [all data]