N-cyclohexyl-(2,4,6-trimethyl)benzaldehyde imine

Phase change data

Data compiled by: William E. Acree, Jr., James S. Chickos

Quantity Value Units Method Reference Comment
Δsub104.9 ± 0.8kJ/molBVerevkin, Morgenthaler, et al., 1997

Enthalpy of fusion

ΔfusH (kJ/mol) Temperature (K) Reference
25.61339.4Verevkin, Morgenthaler, et al., 1997

References

Verevkin, Morgenthaler, et al., 1997
Verevkin, Sergey P.; Morgenthaler, Jens; Rüchardt, Christoph, Thermochemistry of imines: experimental standard molar enthalpies of formation, The Journal of Chemical Thermodynamics, 1997, 29, 10, 1175-1183, https://doi.org/10.1006/jcht.1997.0242 . [all data]