τ-Muurolol

Van Den Dool and Kratz RI, non-polar column, temperature ramp

Data compiled by: NIST Mass Spectrometry Data Center, William E. Wallace, director

Column type CapillaryCapillaryCapillaryCapillaryCapillary
Active phase BP-1BP-1BP-1DB-5Methyl Silicone
Column length (m) 50.50.50.30.30.
Carrier gas HeHeHeHeHe
Substrate
Column diameter (mm) 0.220.220.220.250.25
Phase thickness (μm) 0.250.250.250.250.25
Tstart (C) 60.60.60.60.80.
Tend (C) 220.220.220.240.220.
Heat rate (K/min) 2.2.2.3.2.
Initial hold (min)
Final hold (min) 20.20.20. 15.
I 1628.1627.1627.1643.1635.
ReferenceBoti, Koukoua, et al., 2007Duquesnoy, Castola, et al., 2007Lesueur, de Rocca Serra, et al., 2007Maccioni, Baldini, et al., 2007Melo, Corrêa, et al., 2007
Comment MSDC-RI MSDC-RI MSDC-RI MSDC-RI MSDC-RI
Column type CapillaryCapillaryCapillaryCapillaryCapillary
Active phase RTX-1HP-5SPB-1HP-5MSDB-5
Column length (m) 60.30.30.30.25.
Carrier gas HeHeHeHeHe
Substrate
Column diameter (mm) 0.220.250.250.250.25
Phase thickness (μm) 0.250.250.250.250.25
Tstart (C) 60.50.50.60.60.
Tend (C) 230.250.250.280.200.
Heat rate (K/min) 2.4.5.4.2.
Initial hold (min)  4.3.5.
Final hold (min) 35.10.15. 60.
I 1628.1640.1626.1641.1646.
ReferencePaolini, Muselli, et al., 2007Quijano, Salamanca, et al., 2007Radulovic, Lazarevic, et al., 2007Radulovic, Lazarevic, et al., 2007Rout, Rao, et al., 2007
Comment MSDC-RI MSDC-RI MSDC-RI MSDC-RI MSDC-RI
Column type CapillaryCapillaryCapillaryCapillaryCapillary
Active phase HP-5MSHP-5MSHP-5MSBP-1BP-1
Column length (m) 30.30.30.50.50.
Carrier gas HeHeHe He
Substrate
Column diameter (mm) 0.250.250.250.220.22
Phase thickness (μm) 0.250.250.250.250.25
Tstart (C) 60.60.60.60.60.
Tend (C) 280.280.280.220.220.
Heat rate (K/min) 4.3.3.2.2.
Initial hold (min) 5.
Final hold (min)    20.20.
I 1641.1645.1617.1629.1620.
ReferenceSaroglou, Marin, et al., 2007Vagionas, Ngassapa, et al., 2007Basta, Tzakou, et al., 2006Blanc, Bradesi, et al., 2006Duquesnoy, Dinh, et al., 2006
Comment MSDC-RI MSDC-RI MSDC-RI MSDC-RI MSDC-RI
Column type CapillaryCapillaryCapillaryCapillaryCapillary
Active phase HP-5BP-1DB-1SPB-1OV-1
Column length (m) 30.50.30.30.25.
Carrier gas N2HeN2HeHe
Substrate
Column diameter (mm) 0.250.220.250.250.25
Phase thickness (μm) 0.250.250.250.250.25
Tstart (C) 60.60.50.50.50.
Tend (C) 220.220.220.250.220.
Heat rate (K/min) 5.2.4.5.3.
Initial hold (min) 10.  3.1.
Final hold (min)  20. 15.5.
I 1646.1629.1644.1645.1643.
ReferenceFlamini, Tebano, et al., 2006Gonny, Cavaleiro, et al., 2006Kuiate, Bessière, et al., 2006Radulovic, Mananjarasoa, et al., 2006Rubiolo P., Matteodo M., et al., 2006
Comment MSDC-RI MSDC-RI MSDC-RI MSDC-RI MSDC-RI
Column type CapillaryCapillaryCapillaryCapillaryCapillary
Active phase HP-5MSDB-5HP-5SE-54HP-5
Column length (m) 30.30.30.50.30.
Carrier gas HeHeHeH2N2
Substrate
Column diameter (mm) 0.250.250.250.250.25
Phase thickness (μm) 0.250.250.250.270.25
Tstart (C) 60.50.40.50.60.
Tend (C) 280.250.300.300.220.
Heat rate (K/min) 4.5.4.5.5.
Initial hold (min) 5.2.5. 10.
Final hold (min)
I 1639.1642.1653.1659.1643.
ReferenceSaroglou, Dorizas, et al., 2006Su, Ho, et al., 2006Vundac, Pfeifhofer, et al., 2006Brantner, Pfeifhofer, et al., 2005Celik, Gokturk, et al., 2005
Comment MSDC-RI MSDC-RI MSDC-RI MSDC-RI MSDC-RI
Column type CapillaryCapillaryCapillaryCapillaryCapillary
Active phase HP-5CP Sil 5 CBRTX-1HP-5MSBP-1
Column length (m) 30.50.60.30.50.
Carrier gas N2H2HeHeHe
Substrate
Column diameter (mm) 0.250.220.220.250.22
Phase thickness (μm) 0.250.130.250.250.25
Tstart (C) 60.40.60.60.60.
Tend (C) 220.300.230.250.230.
Heat rate (K/min) 5.4.2.4.2.
Initial hold (min) 10.  2.
Final hold (min)  10.35.20.35.
I 1643.1630.1625.1641.1636.
ReferenceFlamini, Luigi Cioni, et al., 2005Idzojtic, Kajba, et al., 2005Paolini, Costa, et al., 2005Pino, Mesa, et al., 2005Vellutini, Baldovini, et al., 2005
Comment MSDC-RI MSDC-RI MSDC-RI MSDC-RI MSDC-RI
Column type CapillaryCapillaryCapillaryCapillaryCapillary
Active phase HP-5MSHP-5MSHP-5MSHP-5MSSPB-1
Column length (m) 30.30.30.30.30.
Carrier gas HeHeHeHeHe
Substrate
Column diameter (mm) 0.250.250.250.250.25
Phase thickness (μm) 0.250.250.250.250.25
Tstart (C) 80.80.80.60.70.
Tend (C) 290.290.290.280.220.
Heat rate (K/min) 2.4.6.3.3.
Initial hold (min)
Final hold (min)     15.
I 1638.21645.71651.21654.1628.
ReferenceZhao, Liang, et al., 2005Zhao, Liang, et al., 2005Zhao, Liang, et al., 2005Aligiannis, Kalpoutzakis, et al., 2004Antunes, Sevinate-Pinto, et al., 2004
Comment MSDC-RI MSDC-RI MSDC-RI MSDC-RI MSDC-RI
Column type CapillaryCapillaryCapillaryCapillaryCapillary
Active phase SPB-1HP-5HP-5MSHP-5MSDB-5MS
Column length (m) 30.30.30.30.30.
Carrier gas HeN2HeHeHe
Substrate
Column diameter (mm) 0.20.250.250.250.25
Phase thickness (μm) 0.20.250.250.250.25
Tstart (C) 70.60.60.60.40.
Tend (C) 220.220.280.280.280.
Heat rate (K/min) 3.5.4.4.4.
Initial hold (min)  10.5.5.2.
Final hold (min) 15.
I 1615.1642.1640.1641.1654.
ReferenceCavaleiro, Salgueiro, et al., 2004Flamini, Luigi Cioni, et al., 2004Grujic-Jovanovic, Skaltsa, et al., 2004Karioti, Hadjipavlou-Litina, et al., 2004Mardarowicz, Wianowska, et al., 2004
Comment MSDC-RI MSDC-RI MSDC-RI MSDC-RI MSDC-RI
Column type CapillaryCapillaryCapillaryCapillaryCapillary
Active phase RSL-200BP-1HP-5HP-5HP-5MS
Column length (m) 30.30.25.50.30.
Carrier gas H2N2HeHeHe
Substrate
Column diameter (mm) 0.320.320.20.20.25
Phase thickness (μm) 0.250.250.330.20.25
Tstart (C) 40.60.60.35.60.
Tend (C) 280.220.240.250.280.
Heat rate (K/min) 6.5.3.3.3.
Initial hold (min) 5.  15.
Final hold (min) 5.13.7.40.
I 1658.1627.1643.1641.1620.
ReferenceNgassoum, Ousmaila, et al., 2004Raina, Kumar, et al., 2004Sartoratto, Machado, et al., 2004Stashenko, Jaramillo, et al., 2004Tzakou, Vagias, et al., 2004
Comment MSDC-RI MSDC-RI MSDC-RI MSDC-RI MSDC-RI
Column type CapillaryCapillaryCapillaryCapillaryCapillary
Active phase Optima 5DB-5MSDB-5MSDB-1HP-5
Column length (m) 25.30.30.30.30.
Carrier gas HeHeHeN2N2
Substrate
Column diameter (mm) 0.250.250.250.250.25
Phase thickness (μm) 0.250.250.250.250.25
Tstart (C) 60.40.40.50.60.
Tend (C) 280.200.200.200.220.
Heat rate (K/min) 3.4.4.5.5.
Initial hold (min)  5.5. 10.
Final hold (min) 20.20.20.0.
I 1628.1651.1661.1627.1608.
ReferenceVérité, Nacer, et al., 2004Yu, Kim, et al., 2004Yu, Kim, et al., 2004, 2Boyom, Assembe, et al., 2003Campeol, Flamini, et al., 2003
Comment MSDC-RI MSDC-RI MSDC-RI MSDC-RI MSDC-RI
Column type CapillaryCapillaryCapillaryCapillaryCapillary
Active phase SPB-1RTX-1HP-5DB-1DB-1
Column length (m) 30.60.30.30.30.
Carrier gas HeHeN2HeHe
Substrate
Column diameter (mm) 0.20.220.250.250.25
Phase thickness (μm) 0.20.250.250.250.25
Tstart (C) 70.60.60.40.40.
Tend (C) 220.230.220.250.250.
Heat rate (K/min) 3.2.5.2.2.
Initial hold (min)   10.5.5.
Final hold (min) 15.45. 20.
I 1627.1633.1643.1611.1623.
ReferenceCavaleiro, Salgueiro, et al., 2003Cavalli, Tomi, et al., 2003Dural, Bagci, et al., 2003de Feo, Bruno, et al., 2003de Feo, Urrunaga Soria, et al., 2003
Comment MSDC-RI MSDC-RI MSDC-RI MSDC-RI MSDC-RI
Column type CapillaryCapillaryCapillaryCapillaryCapillary
Active phase HP-5HP-5HP-1SPB-1HP-5MS
Column length (m) 30.30.30.30.30.
Carrier gas HeHeHeHe
Substrate
Column diameter (mm) 0.250.250.250.200.25
Phase thickness (μm) 0.250.250.330.200.25
Tstart (C) 60.60.40.70.50.
Tend (C) 280.240.260.220.280.
Heat rate (K/min) 4.3.2.3.3.
Initial hold (min) 5. 5. 5.
Final hold (min)   20.15.
I 1641.1643.1641.1627.1641.
ReferenceKarioti, Skaltsa, et al., 2003Macchioni, Cioni, et al., 2003Senatore, Rigano, et al., 2003Cavaleiro, Salgueiro, et al., 2002Demetzos, Angelopoulou, et al., 2002
Comment MSDC-RI MSDC-RI MSDC-RI MSDC-RI MSDC-RI
Column type CapillaryCapillaryCapillaryCapillaryCapillary
Active phase CP Sil 5 CBRTX-5HP-1CP Sil 5 CBCP Sil 5 CB
Column length (m) 50.30.24.30.50.
Carrier gas H2HeHeH2He
Substrate
Column diameter (mm) 0.250.250.320.250.32
Phase thickness (μm) 0.150.250.170.250.4
Tstart (C) 40.45.60.60.60.
Tend (C) 300.300.250.280.280.
Heat rate (K/min) 4.3.4.2.3.
Initial hold (min) 3.6.2.10.10.
Final hold (min)  10.20.40.60.
I 1654.1650.1621.1630.1622.
ReferenceHeinrich, Pfeifhofer, et al., 2002Mondello, Zappia, et al., 2002Nath, Sarma, et al., 2002Pino, Marbot, et al., 2002Pino, Marbot, et al., 2002, 2
Comment MSDC-RI MSDC-RI MSDC-RI MSDC-RI MSDC-RI
Column type CapillaryCapillaryCapillaryCapillaryCapillary
Active phase HP-5MSDB-5CP Sil 5 CBBP-1BP-1
Column length (m) 30.30.50.50.50.
Carrier gas HeH2HeHe
Substrate
Column diameter (mm) 0.250.250.320.220.22
Phase thickness (μm) 0.250.250.40.250.25
Tstart (C) 60.60.60.60.60.
Tend (C) 280.240.280.220.220.
Heat rate (K/min) 3.3.3.2.2.
Initial hold (min) 5. 10.
Final hold (min)   60.20.20.
I 1641.1643.1622.1630.1638.
ReferenceGiamakis, Kretsi, et al., 2001Nogueira, Bittrich, et al., 2001Pino, Marbot, et al., 2001Rezzi, Bighelli, et al., 2001Rezzi, Cavaleiro, et al., 2001
Comment MSDC-RI MSDC-RI MSDC-RI MSDC-RI MSDC-RI
Column type CapillaryCapillaryCapillaryCapillaryCapillary
Active phase HP-5MSHP-5HP-5DB-5CP Sil 5 CB
Column length (m) 30.30.30.30.50.
Carrier gas HeHeHeHeH2
Substrate
Column diameter (mm) 0.250.250.250.250.22
Phase thickness (μm) 0.250.250.250.250.13
Tstart (C) 60.50.50.60.40.
Tend (C) 280.280.280.240.300.
Heat rate (K/min) 4.4.4.3.4.
Initial hold (min) 5.5.5.2.
Final hold (min)     10.
I 1641.1641.1641.1641.1649.
ReferenceSkaltsa, Mavrommati, et al., 2001Lazari, Skaltsa, et al., 2000Lazari, Skaltsa, et al., 2000, 2Maia, de Paula, et al., 2000Pfeifhofer, 2000
Comment MSDC-RI MSDC-RI MSDC-RI MSDC-RI MSDC-RI
Column type CapillaryCapillaryCapillaryCapillaryCapillary
Active phase HP-5DB-1Methyl SiliconeOV-1DB-1
Column length (m) 30.30.50.25.60.
Carrier gas He N2 He
Substrate
Column diameter (mm) 0.250.250.250.250.25
Phase thickness (μm) 0.250.250.170.30.25
Tstart (C) 50.50.80.50.50.
Tend (C) 280.220.200.200.250.
Heat rate (K/min) 4.3.2.3.3.5
Initial hold (min) 5.3. 1.5.
Final hold (min)    20.
I 1641.1606.1619.1608.1639.
ReferenceLazari, Skaltsa, et al., 1999Muselli, Hoi, et al., 1999Sumathykutty, Rao, et al., 1999Bicchi, Rubiolo, et al., 1998Stashenko, Prada, et al., 1996
Comment MSDC-RI MSDC-RI MSDC-RI MSDC-RI MSDC-RI
Column type Capillary
Active phase HP-101
Column length (m) 50.
Carrier gas N2
Substrate
Column diameter (mm) 0.25
Phase thickness (μm)
Tstart (C) 70.
Tend (C) 200.
Heat rate (K/min) 3.
Initial hold (min)
Final hold (min)
I 1659.
ReferenceChung, Eiserich, et al., 1993
Comment MSDC-RI

Van Den Dool and Kratz RI, polar column, custom temperature program

Data compiled by: NIST Mass Spectrometry Data Center, William E. Wallace, director

Column type CapillaryCapillaryCapillary
Active phase DB-WaxCarbowax 20MHP-Innowax
Column length (m) 30. 30.
Carrier gas He He
Substrate
Column diameter (mm) 0.25 0.25
Phase thickness (μm) 0.25 0.25
Program 40 (5min) => 4C/min => 140C => 4C/min => 200C (20min)not specified60C(8min) => 3C/min => 180C(5min) => 40C/min => 250C
I 2160.2200.2190.
ReferenceZheng, Kim, et al., 2005Lorenzo, Dellacassa, et al., 2000Bisio, Ciarallo, et al., 1998
Comment MSDC-RI MSDC-RI MSDC-RI

Van Den Dool and Kratz RI, non-polar column, custom temperature program

Data compiled by: NIST Mass Spectrometry Data Center, William E. Wallace, director

Column type CapillaryCapillaryCapillaryCapillaryCapillary
Active phase BP-5CBP-5DB-5MSCBP-5SE-52
Column length (m) 25.30.30.50.25.
Carrier gas HeHeHeHeHe
Substrate
Column diameter (mm) 0.220.250.250.250.25
Phase thickness (μm) 0.250.250.250.250.25
Program 30C(1min) => 50C/min => 105C => 1.5C/min => 150C => 30C/min => 280C (10min)60C => 3C/min => 240C => 10C/min => 280C(10min)40 (5min) => 4C/min => 140C => 4C/min => 200C (20min)60C(2min) => 3C/min => 240C => 10C/min => 280C(10min)60C(8min) => 3C/min => 180C => 20C/min => 230C
I 1636.1641.1640.1637.1640.
ReferenceSant'Anna, Fontes, et al., 2007Oliveira, Campos, et al., 2005Zheng, Kim, et al., 2005Azevedo, Campos, et al., 2002Lorenzo, Dellacassa, et al., 2000
Comment MSDC-RI MSDC-RI MSDC-RI MSDC-RI MSDC-RI

References

Boti, Koukoua, et al., 2007
Boti, J.B.; Koukoua, G.; N'Guessan, T.Y.; Casanova, J., Chemical variability of Conyza sumatrensis and Microglossa pyrifolia from Côte d'Ivoire, Flavour Fragr. J., 2007, 22, 1, 27-31, https://doi.org/10.1002/ffj.1743 . [all data]

Duquesnoy, Castola, et al., 2007
Duquesnoy, E.; Castola, V.; Casanova, J., Composition and chemical variability of the twig oil of Abies alba Miller from Corsica, Flavour Fragr. J., 2007, 22, 4, 293-299, https://doi.org/10.1002/ffj.1796 . [all data]

Lesueur, de Rocca Serra, et al., 2007
Lesueur, D.; de Rocca Serra, D.; Bighelli, A.; Hoi, T.M.; Ban, N.K.; Thai, T.H.; Casanova, J., Chemical composition and antibacterial activity of the essential oil of Michelia foveolata Merryll ex Dandy from Vietnam, Flavour Fragr. J., 2007, 22, 4, 317-321, https://doi.org/10.1002/ffj.1799 . [all data]

Maccioni, Baldini, et al., 2007
Maccioni, S.; Baldini, R.; Luigi Cioni, P.; Tebano, M.; Flamini, G., In vivo volatiles emission and essential oils from different organs and pollen of Cistus albidus from Caprione (Eastern Liguria, Italy), Flavour Fragr. J., 2007, 22, 1, 61-65, https://doi.org/10.1002/ffj.1759 . [all data]

Melo, Corrêa, et al., 2007
Melo, R.M.; Corrêa, V.F.S.; Amorim, A.C.L.; Miranda, A.L.P.; Rezende, C.M., Identification of Impact Aroma Compounds in Eugenia uniflora L. (Brazilian Pitanga) Leaf Essential Oil, J. Braz. Chem. Soc., 2007, 18, 1, 179-183, https://doi.org/10.1590/S0103-50532007000100020 . [all data]

Paolini, Muselli, et al., 2007
Paolini, J.; Muselli, A.; Bernardini, A.-F.; Bighelli, A.; Casanova, J.; Costa, J., Thymol derivatives from essential oil of Doronicum corsicum L., Flavour Fragr. J., 2007, 22, 6, 479-487, https://doi.org/10.1002/ffj.1824 . [all data]

Quijano, Salamanca, et al., 2007
Quijano, C.E.; Salamanca, G.; Pino, J.A., Aroma volatile constituents of Colombian varieties of mango (Mangifera indica L.), Flavour Fragr. J., 2007, 22, 5, 401-406, https://doi.org/10.1002/ffj.1812 . [all data]

Radulovic, Lazarevic, et al., 2007
Radulovic, N.; Lazarevic, J.; Ristic, N.; Palic, R., Chemotaxonomic significance of the volatiles in the genus Stachys (Lamiaceae): Essential oil composition of four Balkan Stachys species, Biochem. Syst. Ecol., 2007, 35, 4, 196-208, https://doi.org/10.1016/j.bse.2006.10.010 . [all data]

Rout, Rao, et al., 2007
Rout, P.K.; Rao, Y.R.; Sree., A.; Naik, S.N., Composition of essential oil, concrete, absolute, wax and headspace volatiles of Murrarya paniculata (Linn.) Jack flowers, Flavour Fragr. J., 2007, 22, 5, 352-357, https://doi.org/10.1002/ffj.1804 . [all data]

Saroglou, Marin, et al., 2007
Saroglou, V.; Marin, P.D.; Rancic, A.; Veljic, M.; Skaltsa, H., Composition and antimicrobial activity of the essential oil of six Hypericum species from Serbia, Biochem. Syst. Ecol., 2007, 35, 3, 146-152, https://doi.org/10.1016/j.bse.2006.09.009 . [all data]

Vagionas, Ngassapa, et al., 2007
Vagionas, K.; Ngassapa, O.; Runyoro, D.; Graikou, K.; Gortzi, O.; Chinou, I., Chemical analysis of edible aromatic plants growing in Tanzania, Food Chem., 2007, 105, 4, 1711-1717, https://doi.org/10.1016/j.foodchem.2007.05.029 . [all data]

Basta, Tzakou, et al., 2006
Basta, A.; Tzakou, O.; Couladis, M., The essential oil composition of Phlomis cretica C. Presl, Flavour Fragr. J., 2006, 21, 5, 795-797, https://doi.org/10.1002/ffj.1717 . [all data]

Blanc, Bradesi, et al., 2006
Blanc, M.-C.; Bradesi, P.; Goncalves, M.J.; Salgueiro, L.; Casanova, J., Essential oil of Dittrichia viscosa ssp. viscosa: analysis by 13C-NMR and antimicrobial activity, Flavour Fragr. J., 2006, 21, 2, 324-332, https://doi.org/10.1002/ffj.1605 . [all data]

Duquesnoy, Dinh, et al., 2006
Duquesnoy, E.; Dinh, N.H.; Castola, V.; Casanova, J., Composition of a Pyrolytic oil from Cupressus funebris Endl. of Vietnamese origin, Flavour Fragr. J., 2006, 21, 3, 453-457, https://doi.org/10.1002/ffj.1676 . [all data]

Flamini, Tebano, et al., 2006
Flamini, G.; Tebano, M.; Cioni, P.L.; Bagci, Y.; Dural, H.; Ertugrul, K.; Uysal, T.; Savran, A., A multivariate statistical approach to Centaurea classification using essential oil composition data of some species from Turkey, Pl. Syst. Evol., 2006, 261, 1-4, 217-228, https://doi.org/10.1007/s00606-006-0448-3 . [all data]

Gonny, Cavaleiro, et al., 2006
Gonny, M.; Cavaleiro, C.; Salgueiro, L.; Casanova, J., Analysis of Juniperus communis subsp. alpina needle, berry, wood and root oils by combination of GC, GC/MS and 13C-NMR, Flavour Fragr. J., 2006, 21, 1, 99-106, https://doi.org/10.1002/ffj.1527 . [all data]

Kuiate, Bessière, et al., 2006
Kuiate, J.R.; Bessière, J.M.; Vilarem, G.; Amvam Zollo, P.H., Chemical composition and antidermatophytic properties of the essential oils from leaves, flowers and fruits of Cupressus lusitanica Mill. from Cameroon, Flavour Fragr. J., 2006, 21, 4, 693-697, https://doi.org/10.1002/ffj.1686 . [all data]

Radulovic, Mananjarasoa, et al., 2006
Radulovic, N.; Mananjarasoa, E.; Harinantenaina, L.; Yoshinori, A., Essential oil composition of four Croton species from Madagascar and their chemotaxonomy, Biochem. Syst. Ecol., 2006, 34, 8, 648-653, https://doi.org/10.1016/j.bse.2006.02.005 . [all data]

Rubiolo P., Matteodo M., et al., 2006
Rubiolo P.; Matteodo M.; Riccio G.; Ballero M.; Christen P.; Fleury-Souverain S.; Veuthey J.L.; Bicchi C., Analytical discrimination of poisonous and nonpoisonous chemotypes of giant fennel (Ferula communis L.) through their biologically active and volatile fractions, J. Agric. Food Chem., 2006, 54, 20, 7556-7563, https://doi.org/10.1021/jf061592t . [all data]

Saroglou, Dorizas, et al., 2006
Saroglou, V.; Dorizas, N.; Kypriotakis, Z.; Skaltsa, H.D., Analysis of the essential oil composition of eight Anthemis species from Greece, J. Chromatogr. A, 2006, 1104, 1-2, 313-322, https://doi.org/10.1016/j.chroma.2005.11.087 . [all data]

Su, Ho, et al., 2006
Su, Y.C.; Ho, C.L.; Wang, E.I.C., Analysis of leaf essential oils from the indigenous five conifers of Taiwan, Flavour Fragr. J., 2006, 21, 3, 447-452, https://doi.org/10.1002/ffj.1685 . [all data]

Vundac, Pfeifhofer, et al., 2006
Vundac, V.B.; Pfeifhofer, H.W.; Brantner, A.H.; Males, Z.; Plazibat, M., Essential oils of seven Stachys taxa from Croatia, Biochem. Syst. Ecol., 2006, 34, 12, 875-881, https://doi.org/10.1016/j.bse.2006.04.010 . [all data]

Brantner, Pfeifhofer, et al., 2005
Brantner, A.H.; Pfeifhofer, H.W.; Ercegovac, O.; Males, Z.; Plazibat, M., Essential oil composition and antioxidant activity of Thymus bracteosus Vis. ex Benth., Flavour Fragr. J., 2005, 20, 6, 596-600, https://doi.org/10.1002/ffj.1494 . [all data]

Celik, Gokturk, et al., 2005
Celik, S.; Gokturk, R.S.; Flamini, G.; Cioni, P.L.; Morelli, I., Essential oils of Phlomis leucophracta, Phlomis chimerae and Phlomis grandiflora var. grandiflora from Turkey, Biochem. Syst. Ecol., 2005, 33, 6, 617-623, https://doi.org/10.1016/j.bse.2004.11.010 . [all data]

Flamini, Luigi Cioni, et al., 2005
Flamini, G.; Luigi Cioni, P.; Morelli, I.; Celik, S.; Gokturk, R.S.; Unal, O., Essential oil of Stachys aleurites from Turkey, Biochem. Syst. Ecol., 2005, 33, 1, 61-66, https://doi.org/10.1016/j.bse.2004.05.013 . [all data]

Idzojtic, Kajba, et al., 2005
Idzojtic, M.; Kajba, D.; Franjic, J., Differentiation of F1 hybrids P. nigra J. F. Arnold × P. sylvestris L., P. nigra J. F. Arnold × P. densiflora Siebold et Zucc., P. nigra J. F. Arnold × P. thunbergiana Franco and their parental species by needle volatile composition, Biochem. Syst. Ecol., 2005, 33, 4, 427-439, https://doi.org/10.1016/j.bse.2004.10.008 . [all data]

Paolini, Costa, et al., 2005
Paolini, J.; Costa, J.; Bernardini, A., Analysis of the essential oil from aerial parts of Eupatorium cannabinum subsp. corsicum (L.) by gas chromatography with electron impact and chemical ionization mass spectrometry, J. Chromatogr. A, 2005, 1076, 1-2, 170-178, https://doi.org/10.1016/j.chroma.2005.03.131 . [all data]

Pino, Mesa, et al., 2005
Pino, J.A.; Mesa, J.; Muñoz, Y.; Martí, M.P.; Marbot, R., Volatile components from mango (Mangifera indica L.) cultivars, J. Agric. Food Chem., 2005, 53, 6, 2213-2223, https://doi.org/10.1021/jf0402633 . [all data]

Vellutini, Baldovini, et al., 2005
Vellutini, M.; Baldovini, N.; de Rocca Serra, D. Tomi; Casanova, J., β-Cyclolavandulyl and β-isocyclolavandulyl esters from Peucedanum paniculatum L., an endemic species to Corsica, Phytochemistry, 2005, 66, 16, 1956-1962, https://doi.org/10.1016/j.phytochem.2005.07.001 . [all data]

Zhao, Liang, et al., 2005
Zhao, C.-X.; Liang, Y.-Z.; Fang, H.-Z.; Li, X.-N., Temperature-programmed retention indices for gas chromatography-mass spectroscopy analysis of plant essential oils, J. Chromatogr. A, 2005, 1096, 1-2, 76-85, https://doi.org/10.1016/j.chroma.2005.09.067 . [all data]

Aligiannis, Kalpoutzakis, et al., 2004
Aligiannis, N.; Kalpoutzakis, E.; Kyriakopoulou, I.; Mitaku, S.; Chinou, I.B., Essential oils of Phlomis species growing in Greece: chemical composition and antimicrobial activity, Flavour Fragr. J., 2004, 19, 4, 320-324, https://doi.org/10.1002/ffj.1305 . [all data]

Antunes, Sevinate-Pinto, et al., 2004
Antunes, T.; Sevinate-Pinto, I.; Barroso, J.G.; Cavaleiro, C.; Salgueiro, L.R., Micromorphology of trichomes and composition of essential oil of Teucrium capitatum, Flavour Fragr. J., 2004, 19, 4, 336-340, https://doi.org/10.1002/ffj.1310 . [all data]

Cavaleiro, Salgueiro, et al., 2004
Cavaleiro, C.; Salgueiro, L.R.; Miguel, M.G.; da Cunha, A.P., Analysis by gas chromatography?mass spectrometry of the volatile components of Teucrium lusitanicum and Teucrium algarbiensis, J. Chromatogr. A, 2004, 1033, 1, 187-190, https://doi.org/10.1016/j.chroma.2004.01.005 . [all data]

Flamini, Luigi Cioni, et al., 2004
Flamini, G.; Luigi Cioni, P.; Morelli, I., Essential oils of Galeopsis pubescens and G. tetrahit from Tuscany (Italy), Flavour Fragr. J., 2004, 19, 4, 327-329, https://doi.org/10.1002/ffj.1307 . [all data]

Grujic-Jovanovic, Skaltsa, et al., 2004
Grujic-Jovanovic, S.; Skaltsa, H.D.; Marin, P.; Sokovic, M., Composition and antibacterial activity of the essential oil of six Stachys species from Serbia, Flavour Fragr. J., 2004, 19, 2, 139-144, https://doi.org/10.1002/ffj.1275 . [all data]

Karioti, Hadjipavlou-Litina, et al., 2004
Karioti, A.; Hadjipavlou-Litina, D.; Mensah, M.L.K.; Fleischer, T.C.; Skaltsa, H., Composition and antioxidant activity of the essential oils of Xylopia aethiopica (Dun) A. Rich. (Annonaceae) leaves, stem bark, root bark, and fresh and dried fruits, growing in Ghana, J. Agric. Food Chem., 2004, 52, 26, 8094-8098, https://doi.org/10.1021/jf040150j . [all data]

Mardarowicz, Wianowska, et al., 2004
Mardarowicz, M.; Wianowska, D.; Dawidowicz, A.L.; Sawicki, R., The influence of sample treatment on SPME extracts from conifers. I. Comparison of terpene composition in Engelmann Spruce (Picea engelmanii) using hydrodistillation, SPME and PLE, Annales Universitatis Mariae Curie-Sklodowska Lublin - Polonia, 2004, 59, 3, 25-42. [all data]

Ngassoum, Ousmaila, et al., 2004
Ngassoum, M.B.; Ousmaila, H.; Ngamo, L.T.; Maponmetsem, P.M.; Jirovetz, L.; Buchbauer, G., Aroma compounds of essential oils of two varieties of the spice plant Ocimum canum Sims from northern Cameroon, J. Food Comp. Anal., 2004, 17, 2, 197-204, https://doi.org/10.1016/j.jfca.2003.08.002 . [all data]

Raina, Kumar, et al., 2004
Raina, V.K.; Kumar, A.; Srivastava, S.K.; Syamsundar, K.V.; Kahol, A.P., Essential oil composition of 'kewda' (Pandanus odoratissimus) from India, Flavour Fragr. J., 2004, 19, 5, 434-436, https://doi.org/10.1002/ffj.1331 . [all data]

Sartoratto, Machado, et al., 2004
Sartoratto, A.; Machado, A.L.M.; Delarmelina, C.; Figueira, G.M.; Duarte, M.C.T.; Rehder, V.L.G., Composition and antimicrobial activity of essential oils from aromatic plants used in Brazil, Braz. J. Microbiol., 2004, 35, 4, 275-280, https://doi.org/10.1590/S1517-83822004000300001 . [all data]

Stashenko, Jaramillo, et al., 2004
Stashenko, E.E.; Jaramillo, B.E.; Martínez, J.R., Comparison of different extraction methods for the analysis of volatile secondary metabolites of Lippia alba (Mill.) N.E. Brown, grown in Colombia, and evaluation of its in vitro antioxidant activity, J. Chromatogr. A, 2004, 1025, 1, 93-103, https://doi.org/10.1016/j.chroma.2003.10.058 . [all data]

Tzakou, Vagias, et al., 2004
Tzakou, O.; Vagias, C.; Gani, A.; Yannitsaros, A., Volatile constituents of essential oils isolated at different growth stages from three Conyza species growing in Greece, Flavour Fragr. J., 2004, 19, 425-428. [all data]

Vérité, Nacer, et al., 2004
Vérité, P.; Nacer, A.; Kabouche, Z.; Seguin, E., Composition of seeds and stems essential oils of Pituranthos scoparius (Coss. Dur.) Schinz, Flavour Fragr. J., 2004, 19, 6, 562-564, https://doi.org/10.1002/ffj.1353 . [all data]

Yu, Kim, et al., 2004
Yu, E.J.; Kim, T.H.; Kim, K.H.; Lee, H.J., Aroma-active compounds of Pinus densiflora (red pine) needles, Flavour Fragr. J., 2004, 19, 6, 532-537, https://doi.org/10.1002/ffj.1337 . [all data]

Yu, Kim, et al., 2004, 2
Yu, E.J.; Kim, T.H.; Kim, K.H.; Lee, H.J., Characterization of aroma-active compounds of Abies nephrolepis (Khingan fir) needles using aroma extract dilution analysis, Flavour Fragr. J., 2004, 19, 1, 74-79, https://doi.org/10.1002/ffj.1314 . [all data]

Boyom, Assembe, et al., 2003
Boyom, F.F.; Assembe, E.Z.; Zollo, P.H.A.; Agnaniet, H.; Menut, C.; Bessière, J.M., Aromatic plants of tropical central Africa. Part XLII. Volatile components from Antidesma laciniatum Muell. Arg. Var. laciniatum growing in Cameroon, Flavour Fragr. J., 2003, 18, 5, 451-453, https://doi.org/10.1002/ffj.1251 . [all data]

Campeol, Flamini, et al., 2003
Campeol, E.; Flamini, G.; Cioni, P.L.; Morelli, I.; Cremonini, R.; Ceccarini, L., Volatile fractions from three cultivars of Olea eruopaea L. collected in two different seasons, J. Agric. Food Chem., 2003, 51, 7, 1994-1999, https://doi.org/10.1021/jf026025u . [all data]

Cavaleiro, Salgueiro, et al., 2003
Cavaleiro, C.; Salgueiro, L.R.; da Cunha, A.P.; Figueiredo, A.C.; Barroso, J.G.; Bighelli, A.; Casanova, J., Composition and variability of the essential oils of the leaves and berries from Juniperus navicularis, Biochem. Syst. Ecol., 2003, 31, 2, 193-201, https://doi.org/10.1016/S0305-1978(02)00080-7 . [all data]

Cavalli, Tomi, et al., 2003
Cavalli, J.-F.; Tomi, F.; Bernardini, A.-F.; Casanova, J., Composition and chemical variability of the bark oil of Cedrelopsis grevei H. Baillon from Madagascar, Flavour Fragr. J., 2003, 18, 6, 532-538, https://doi.org/10.1002/ffj.1263 . [all data]

Dural, Bagci, et al., 2003
Dural, H.; Bagci, Y.; Ertugrul, K.; Demirelma, H.; Flamini, G.; Cioni, P.L.; Morelli, I., Essential oil composition of two endemic Centaurea species from Turkey, Centaurea mucronifera and Centaurea chrysantha, collected in the same habitat, Biochem. Syst. Ecol., 2003, 31, 12, 1417-1425, https://doi.org/10.1016/S0305-1978(03)00128-5 . [all data]

de Feo, Bruno, et al., 2003
de Feo, V.; Bruno, M.; Tahiri, B.; Napolitano, F.; Senatore, F., Chemical composition and antibacterial activity of essential oils from Thymus spinulosus Ten. (Lamiaceae), J. Agric. Food Chem., 2003, 51, 13, 3849-3853, https://doi.org/10.1021/jf021232f . [all data]

de Feo, Urrunaga Soria, et al., 2003
de Feo, V.; Urrunaga Soria, E.; Urrunaga Soria, R.; Senatore, F., Chemical composition of essential oils of senecio nutans Sch.-Bip. (Asteraceae), Flavour Fragr. J., 2003, 18, 3, 234-236, https://doi.org/10.1002/ffj.1204 . [all data]

Karioti, Skaltsa, et al., 2003
Karioti, A.; Skaltsa, H.; Demetzos, C.; Perdetzoglou, D.; Economakis, C.D.; Salem, A.B., Effect of nitrogen concentration of the nutrient solution on the volatile constituents of leaves of Salvia fruticosa Mill. in solution culture, J. Agric. Food Chem., 2003, 51, 22, 6505-6508, https://doi.org/10.1021/jf030308k . [all data]

Macchioni, Cioni, et al., 2003
Macchioni, F.; Cioni, P.L.; Flamini, G.; Morelli, I.; Maccioni, S.; Ansaldi, M., Chemical composition of essential oils from needles, branches and cones of Pinus pinea, P. halepensis, P. pinaster and P. nigra from central Italy, Flavour Fragr. J., 2003, 18, 2, 139-143, https://doi.org/10.1002/ffj.1178 . [all data]

Senatore, Rigano, et al., 2003
Senatore, F.; Rigano, D.; de Fusco, R.; Bruno, M., Volatile components of Centaurea cineraria L. subsp. umbrosa (lacaita) Pign. and Centaurea napifolia L. (Asteraceae), two species growing wild in Sicily, Flavour Fragr. J., 2003, 18, 3, 248-251, https://doi.org/10.1002/ffj.1179 . [all data]

Cavaleiro, Salgueiro, et al., 2002
Cavaleiro, C.; Salgueiro, L.R.; Antunes, T.; Sevinate-Pinto, I.; Barroso, J.G., Composition of the essential oil and micromorphology of trichomes of Teucrium salviastrum, an endemic species from Portugal, Flavour Fragr. J., 2002, 17, 4, 287-291, https://doi.org/10.1002/ffj.1068 . [all data]

Demetzos, Angelopoulou, et al., 2002
Demetzos, C.; Angelopoulou, D.; Perdetzoglou, D., A comparative study of the essential oils of Cistus salviifolius in several populations of Crete (Greece), Biochem. Syst. Ecol., 2002, 30, 7, 651-665, https://doi.org/10.1016/S0305-1978(01)00145-4 . [all data]

Heinrich, Pfeifhofer, et al., 2002
Heinrich, G.; Pfeifhofer, H.W.; Stabentheiner, E.; Sawidis, T., Glandular hairs of Sigesbeckia jorullensis Kunth (Asteraceae): morphology, histochemistry and composition of essential oil, Ann. Bot. Rome, 2002, 89, 4, 459-469, retrieved from http://www.aob.oupjournals.org, https://doi.org/10.1093/aob/mcf062 . [all data]

Mondello, Zappia, et al., 2002
Mondello, L.; Zappia, G.; Cotroneo, A.; Bonaccorsi, I.; Chowdhury, J.U.; Yusuf, M.; Dugo, G., Studies on the essential oil-bearing plants of Bangladesh. Part VIII. Composition of some Ocimum oils O. basilicum L. var. purpurascens; O. sanctum L. green; O. sanctum L. purple; O. americanum L., citral type; O. americanum L., camphor type, Flavour Fragr. J., 2002, 17, 5, 335-340, https://doi.org/10.1002/ffj.1108 . [all data]

Nath, Sarma, et al., 2002
Nath, S.C.; Sarma, K.K.; Vajezikova, I.; Leclercq, P.A., Comparison of volatile inflorescence oils and taxonomy of certain Cymbopogon taxa described as Cymbopogon flexuosus (Nees ex Steud.) Wats., Biochem. Syst. Ecol., 2002, 30, 2, 151-162, https://doi.org/10.1016/S0305-1978(01)00066-7 . [all data]

Pino, Marbot, et al., 2002
Pino, J.A.; Marbot, R.; Bello, A., Volatile compounds of Psidium salutare (H.B.K.) Berg. fruit, J. Agric. Food Chem., 2002, 50, 18, 5146-5148, https://doi.org/10.1021/jf0116303 . [all data]

Pino, Marbot, et al., 2002, 2
Pino, J.A.; Marbot, R.; Vázquez, C., Characterization of volatile in Cosa Rican Guava [Psidium friedrichsthalianum (Berg) Niedenzu] fruit, J. Agric. Food Chem., 2002, 50, 21, 6023-6026, https://doi.org/10.1021/jf011456i . [all data]

Giamakis, Kretsi, et al., 2001
Giamakis, A.; Kretsi, O.; Chinou, I.; Spyropoulos, C.G., Eucalyptus camaldulensis: volatiles from immature flowers and high production of 1,8-cineole and β-pinene by in vitro cultures, Phytochemistry, 2001, 58, 2, 351-355, https://doi.org/10.1016/S0031-9422(01)00193-5 . [all data]

Nogueira, Bittrich, et al., 2001
Nogueira, P.C.L.; Bittrich, V.; Shepherd, G.J.; Lopes, A.V.; Marsaioli, A.J., The ecological and taxonomic importance of flower volatiles of Clusia species (Guttiferae), Phytochemistry, 2001, 56, 5, 443-452, https://doi.org/10.1016/S0031-9422(00)00213-2 . [all data]

Pino, Marbot, et al., 2001
Pino, J.A.; Marbot, R.; Vázquez, C., Characterization of volatiles in strawberry guava (Psidium cattleianum Sabine) fruit, J. Agric. Food Chem., 2001, 49, 12, 5883-5887, https://doi.org/10.1021/jf010414r . [all data]

Rezzi, Bighelli, et al., 2001
Rezzi, S.; Bighelli, A.; Mouillot, D.; Casanova, J., Composition and chemical variability of the needle essential oil of Pinus nigra subsp. laricio from corsica, Flavour Fragr. J., 2001, 16, 5, 379-383, https://doi.org/10.1002/ffj.1018 . [all data]

Rezzi, Cavaleiro, et al., 2001
Rezzi, S.; Cavaleiro, C.; Bighelli, A.; Salgueiro, L.; da Cunha, A.P.; Casanova, J., Intraspecific chemical variability of the leaf essential oil of Juniperus phoenicea subsp. turbinata from Corsica, Biochem. Syst. Ecol., 2001, 29, 2, 179-188, https://doi.org/10.1016/S0305-1978(00)00044-2 . [all data]

Skaltsa, Mavrommati, et al., 2001
Skaltsa, H.D.; Mavrommati, A.; Constantinidis, T., A chemotaxonomic investigation of volatile constituents in Stachys subsect. Swainsonianeae (Labiatae), Phytochemistry, 2001, 57, 2, 235-244, https://doi.org/10.1016/S0031-9422(01)00003-6 . [all data]

Lazari, Skaltsa, et al., 2000
Lazari, D.M.; Skaltsa, H.D.; Constantinidis, T., Volatile constituents of Cerastium candidissimum, a Greek endemic species, Flavour Fragr. J., 2000, 15, 3, 174-176, https://doi.org/10.1002/1099-1026(200005/06)15:3<174::AID-FFJ886>3.0.CO;2-Y . [all data]

Lazari, Skaltsa, et al., 2000, 2
Lazari, D.M.; Skaltsa, H.D.; Constantinidis, T., Volatile constituents of Centaurea pelia DC., C. thessala Hausskn. subsp. drakiensis (Freyn Sint.) Georg. and C. zuccariniana DC. from Greece, Flavour Fragr. J., 2000, 15, 1, 7-11, https://doi.org/10.1002/(SICI)1099-1026(200001/02)15:1<7::AID-FFJ860>3.0.CO;2-3 . [all data]

Maia, de Paula, et al., 2000
Maia, B.H.L.N.S.; de Paula, J.R.; Sant'Ana, J.; da Silva, M.F.G.F.; Fernandes, J.B.; Vieira, P.C.; Costa, M.S.S.; Ohashi, O.S.; Silva, J.N.M., Essential oils of Toona and Cedrela species (Meliaceae): Taxonomic and ecological implications, J. Braz. Chem. Soc., 2000, 11, 6, 629-639, https://doi.org/10.1590/S0103-50532000000600012 . [all data]

Pfeifhofer, 2000
Pfeifhofer, H.W., Composition of the essential oil of Pinus canariensis Sweet ex Sprengel, Flavour Fragr. J., 2000, 15, 4, 266-270, https://doi.org/10.1002/1099-1026(200007/08)15:4<266::AID-FFJ908>3.0.CO;2-E . [all data]

Lazari, Skaltsa, et al., 1999
Lazari, D.M.; Skaltsa, H.D.; Constantinidis, T., Essential oils of Marrubium velutinum Sm. and Marrubium peregrinum L., growing wild in Greece, Flavour Fragr. J., 1999, 14, 5, 290-292, https://doi.org/10.1002/(SICI)1099-1026(199909/10)14:5<290::AID-FFJ828>3.0.CO;2-4 . [all data]

Muselli, Hoi, et al., 1999
Muselli, A.; Hoi, T.M.; Cu, L.D.; Moi, L.D.; Bessière, J.-M.; Bighelli, A.; Casanova, J., Composition of the essential oil of Acanthopanax trifoliatus (L.) Merr. (Araliacaea) from Vietnam, Flavour Fragr. J., 1999, 14, 1, 41-44, https://doi.org/10.1002/(SICI)1099-1026(199901/02)14:1<41::AID-FFJ781>3.0.CO;2-B . [all data]

Sumathykutty, Rao, et al., 1999
Sumathykutty, M.A.; Rao, J.M.; Padmakumari, K.P.; Narayanan, C.S., Essential oil constituents of some Piper species, Flavour Fragr. J., 1999, 14, 5, 279-282, https://doi.org/10.1002/(SICI)1099-1026(199909/10)14:5<279::AID-FFJ821>3.0.CO;2-0 . [all data]

Bicchi, Rubiolo, et al., 1998
Bicchi, C.; Rubiolo, P.; Marschall, H.; Weyerstahl, P.; Laurent, R., Constituents of Artemisia roxburghiana Besser essential oil, Flavour Fragr. J., 1998, 13, 1, 40-46, https://doi.org/10.1002/(SICI)1099-1026(199801/02)13:1<40::AID-FFJ688>3.0.CO;2-Z . [all data]

Stashenko, Prada, et al., 1996
Stashenko, E.E.; Prada, N.Q.; Martínez, J.R., HRGC/FID/NP and HRGC/MSD study of Colombian Ylang-Ylang (Cananga odorata) oils obtained by different extraction techniques, J. Hi. Res. Chromatogr., 1996, 19, 6, 353-358, https://doi.org/10.1002/jhrc.1240190609 . [all data]

Chung, Eiserich, et al., 1993
Chung, T.Y.; Eiserich, J.P.; Shibamoto, T., Volatile compounds isolated from edible Korean chamchwi (Aster scaber Thunb), J. Agric. Food Chem., 1993, 41, 10, 1693-1697, https://doi.org/10.1021/jf00034a033 . [all data]