Hop ether

Kovats' RI, polar column, temperature ramp

View large format table.

Column type Active phase I Reference Comment
CapillaryCarbowax 20M1360.Tressl, Friese, et al., 1978He, 2. K/min; Column length: 50. m; Column diameter: 0.28 mm; Tstart: 70. C; Tend: 190. C
CapillaryCarbowax 20M1362.Tressl, Friese, et al., 1978, 2He, 2. K/min; Column length: 50. m; Column diameter: 0.28 mm; Tstart: 70. C; Tend: 190. C

References

Tressl, Friese, et al., 1978
Tressl, R.; Friese, L.; Fendesack, F.; Köppler, H., Gas chromatographic--mass spectrometric investigation of hop aroma constituents in beer, J. Agric. Food Chem., 1978, 26, 6, 1422-1426, https://doi.org/10.1021/jf60220a037 . [all data]

Tressl, Friese, et al., 1978, 2
Tressl, R.; Friese, L.; Fendesack, F.; Köppler, H., Studies of the volatile composition of hops during storage, J. Agric. Food Chem., 1978, 26, 6, 1426-1430, https://doi.org/10.1021/jf60220a036 . [all data]