Acetaldehyde-2,2,2-d3

Gas phase ion energetics data

Data compiled by: Sharon G. Lias, Rhoda D. Levin, and Sherif A. Kafafi

Ionization energy determinations

IE (eV) Method Reference
10.19PIJochims, Lohr, et al., 1978

Appearance energy determinations

Ion AE (eV) Other Products MethodReferenceComment
CDO+12.65?PIJochims, Lohr, et al., 1978
CD3+14.15?PIJochims, Lohr, et al., 1978
CHD2+14.25?PIJochims, Lohr, et al., 1978
CHD3+12.77?PIJochims, Lohr, et al., 1978
CHO+11.98?PIJochims, Lohr, et al., 1978
CHO+12.03CH3PIJochims, Lohr, et al., 1978
CHO+12.03 ± 0.03CH3PIKrassig, Reinke, et al., 1974
C2D3O+10.91HPIJochims, Lohr, et al., 1978

References

Jochims, Lohr, et al., 1978
Jochims, H.-W.; Lohr, W.; Baumgartel, H., Photoionization mass spectrometry studies of deuterated acetaldehydes CH3CDO and CD3CHO, Chem. Phys. Lett., 1978, 54, 594. [all data]

Krassig, Reinke, et al., 1974
Krassig, R.; Reinke, D.; Baumgartel, H., Photo-reaktionen kleiner organischer molekule II. Die photoionenspektren der Isomeren propylen-cyclopropan und acetaldehyd-athylenoxyd, Ber. Bunsen-Ges. Phys. Chem., 1974, 78, 425. [all data]