(2E,4S,7E)-4-Isopropyl-1,7-dimethylcyclodeca-2,7-dienol

Normal alkane RI, non-polar column, temperature ramp

Data compiled by: NIST Mass Spectrometry Data Center, William E. Wallace, director

Column type CapillaryCapillaryCapillaryCapillaryCapillary
Active phase HP-5 MSHP-5 MSDB-5HP-5 MSHP-5
Column length (m) 30.30.30.30.30.
Carrier gas HeliumHydrogenNitrogenHeliumHelium
Substrate
Column diameter (mm) 0.250.250.250.250.25
Phase thickness (μm) 0.250.250.250.250.25
Tstart (C) 60.30.40.50.50.
Tend (C) 220.230.230.280.300.
Heat rate (K/min) 5.8.2.4.3.
Initial hold (min) 10.5.
Final hold (min)  10.  30.
I 1575.1595.1576.1579.1571.
ReferenceOgunwande, Flamini, et al., 2010Karlsson, Birgersson, et al., 2009Scrivanti, Anton, et al., 2009Zhao, Zeng, et al., 2009Isidorov, Lech, et al., 2008
Comment MSDC-RI MSDC-RI MSDC-RI MSDC-RI MSDC-RI
Column type CapillaryCapillaryCapillaryCapillaryCapillary
Active phase SLB-5 MSRTX-1HP-5MSHP-5HP-5MS
Column length (m) 30.60.30.30.30.
Carrier gas HeliumHeHeN2He
Substrate
Column diameter (mm) 0.250.220.250.250.25
Phase thickness (μm) 0.250.250.250.250.25
Tstart (C) 50.60.60.50.60.
Tend (C) 250.230.240.240.250.
Heat rate (K/min) 3.2.3.5.2.
Initial hold (min) 2.  1.8.
Final hold (min) 10.35. 4.15.
I 1579.1573.1597.1574.1567.
ReferenceLo Presti, Sciarrone, et al., 2008Paolini, Tomi, et al., 2008Argyropoulou, Daferera, et al., 2007Cheraif, Ben Jannet, et al., 2007Ferhat, Meklati, et al., 2007
Comment MSDC-RI MSDC-RI MSDC-RI MSDC-RI MSDC-RI
Column type CapillaryCapillaryCapillaryCapillaryCapillary
Active phase HP-5MSCol-Elite 5MSDB-1Elite-5MSHP-5
Column length (m) 30.30.50.30.30.
Carrier gas HeHeHeHeHe
Substrate
Column diameter (mm) 0.250.250.250.320.25
Phase thickness (μm) 0.250.250.250.50.25
Tstart (C) 60.30.95.40.50.
Tend (C) 250.246.240.280.300.
Heat rate (K/min) 2.3.4.4.5.
Initial hold (min) 8.  5.5.
Final hold (min) 15.  10.5.
I 1572.1597.1578.1578.1579.
ReferenceFerhat, Tigrine-Kordjani, et al., 2007Gudaityte and Venskutonis R.P., 2007Pala-Paul, Brophy, et al., 2007Tava, Pecetti, et al., 2007Figuérédo, Cabassu, et al., 2006
Comment MSDC-RI MSDC-RI MSDC-RI MSDC-RI MSDC-RI
Column type CapillaryCapillaryCapillaryCapillaryCapillary
Active phase DB-5CP Sil 5 CBDB-5DB-1DB-1
Column length (m) 30.30.30.50.50.
Carrier gas  N2HeN2N2
Substrate
Column diameter (mm) 0.250.320.250.250.25
Phase thickness (μm) 0.250.250.250.250.25
Tstart (C) 40.50.60.95.90.
Tend (C) 210.300.220.240.240.
Heat rate (K/min) 2.4.4.4.4.
Initial hold (min) 2.
Final hold (min) 33.
I 1573.1560.1577.1597.1559.
ReferenceGarneau F.X., Collin G., et al., 2006Lis and Milczarek, 2006Morteza-Semnani, Akbarzadeh, et al., 2006Pala-Paul J., Perez-Alonso M.J., et al., 2006Velasco-Negueruela, Pérez-Alonso, et al., 2006
Comment MSDC-RI MSDC-RI MSDC-RI MSDC-RI MSDC-RI
Column type CapillaryCapillaryCapillaryCapillaryCapillary
Active phase HP-5HP-5DB-5DB-1HP-5MS
Column length (m) 25.25.30.50.30.
Carrier gas HeH2HeN2
Substrate
Column diameter (mm) 0.20.320.250.250.2
Phase thickness (μm) 0.330.520.250.25
Tstart (C) 60.40.60.95.60.
Tend (C) 240.240.220.240.280.
Heat rate (K/min) 3.4.4.4.3.
Initial hold (min)   4.
Final hold (min) 7.
I 1569.1560.1578.1578.1576.
ReferenceDuarte, Figueira, et al., 2005Jovanovic, Kitic, et al., 2005Morteza-Semnani and Saeedi, 2005Pala-Paul, Perez-Alonso, et al., 2005Petrakis, Roussis, et al., 2005
Comment MSDC-RI MSDC-RI MSDC-RI MSDC-RI MSDC-RI
Column type CapillaryCapillaryCapillaryCapillaryCapillary
Active phase HP-5MSHP-5MSRTX-5DB-5HP-5 MS
Column length (m) 30.30.30.30.30.
Carrier gas HeHe HeHelium
Substrate
Column diameter (mm) 0.250.250.250.320.25
Phase thickness (μm) 0.250.250.250.250.25
Tstart (C) 60.60.60.60.60.
Tend (C) 280.280.220.280.240.
Heat rate (K/min) 4.3.3.3.3.
Initial hold (min)
Final hold (min)
I 1576.1574.1573.1550.1576.
ReferenceSajjadi S.E. and Eskandari B., 2005Slavkovska, Couladis, et al., 2005Szafranek, Chrapkowska, et al., 2005Tzakou and Constantinidis, 2005Urdampilleta, Amat, et al., 2005
Comment MSDC-RI MSDC-RI MSDC-RI MSDC-RI MSDC-RI
Column type CapillaryCapillaryCapillaryCapillaryCapillary
Active phase CP Sil 5 CBSE-54NB-30DB-5RTX-5Sil
Column length (m) 30.30.50.30.30.
Carrier gas N2HeHeHeHe
Substrate
Column diameter (mm) 0.250.250.200.250.25
Phase thickness (μm) 0.250.250.250.250.25
Tstart (C) 50.60.50.60.70.
Tend (C) 200.260.250.300.200.
Heat rate (K/min) 5.2.2.3.4.
Initial hold (min)  5.
Final hold (min)     10.
I 1570.1568.1576.1576.1577.
ReferenceAgnaniet, Menut, et al., 2004Kilic, Hafizoglu, et al., 2004Raal, Paaver, et al., 2004Tirillini, Pellegrino, et al., 2004Dudai, Larkov, et al., 2003
Comment MSDC-RI MSDC-RI MSDC-RI MSDC-RI MSDC-RI
Column type CapillaryCapillaryCapillaryCapillaryCapillary
Active phase HP-5DB-5DB-55 % Phenyl methyl siloxaneOV-101
Column length (m) 30.30.30.30.25.
Carrier gas He HeHeHe
Substrate
Column diameter (mm) 0.250.250.2490.250.32
Phase thickness (μm) 0.250.250.250.25
Tstart (C) 60.40.60.75.50.
Tend (C) 280.260.300.200.200.
Heat rate (K/min) 4.2.3.3.5.
Initial hold (min)  5. 4.
Final hold (min)   5.8.
I 1573.1575.1574.1576.1570.
ReferenceSajjadi and Mehregan, 2003Senatore and Bruno, 2003Bos, Koulman, et al., 2002Cicció and Gómez-Laurito, 2002Menut, Bessière, et al., 2002
Comment MSDC-RI MSDC-RI MSDC-RI MSDC-RI MSDC-RI
Column type CapillaryCapillaryCapillary
Active phase Optima-5OV-101DB-1
Column length (m) 30.25.25.
Carrier gas HeN2He
Substrate
Column diameter (mm) 0.20.250.25
Phase thickness (μm)   0.25
Tstart (C) 50.50.50.
Tend (C) 250.200.290.
Heat rate (K/min) 3.5.4.
Initial hold (min) 3.
Final hold (min)
I 1582.1570.1574.
ReferenceJacquemond-Collet, Bessière, et al., 2001Ayedoun, Adéoti, et al., 1999Koulman, 1999
Comment MSDC-RI MSDC-RI MSDC-RI

Van Den Dool and Kratz RI, non-polar column, temperature ramp

Data compiled by: NIST Mass Spectrometry Data Center, William E. Wallace, director

Column type CapillaryCapillaryCapillaryCapillaryCapillary
Active phase HP-5HP-5DB-5HP-5MSDB-5
Column length (m) 30.30.30.30.50.
Carrier gas N2N2 HeN2
Substrate
Column diameter (mm) 0.250.250.220.250.2
Phase thickness (μm) 0.250.250.250.250.32
Tstart (C) 50.60.60.60.60.
Tend (C) 220.220.240.280.220.
Heat rate (K/min) 5.5.3.3.5.
Initial hold (min) 10.10.2. 3.
Final hold (min)     5.
I 1578.1574.1574.1574.1574.
ReferenceFlamini, Tebano, et al., 2007Flamini, Tebano, et al., 2007, 2Martins, Santos, et al., 2007Kukic J., Petrovic S., et al., 2006Masoudi, Esmaeili, et al., 2006
Comment MSDC-RI MSDC-RI MSDC-RI MSDC-RI MSDC-RI
Column type CapillaryCapillaryCapillaryCapillaryCapillary
Active phase HP-5MSHP-5HP-5MSRSL-200HP-5MS
Column length (m) 30.30.30.30.30.
Carrier gas He HeH2He
Substrate
Column diameter (mm) 0.250.250.250.320.25
Phase thickness (μm) 0.250.250.250.250.25
Tstart (C) 60.60.60.40.60.
Tend (C) 300.220.280.280.280.
Heat rate (K/min) 3.5.4.6.3.
Initial hold (min)  10.5.5.
Final hold (min)    5.
I 1571.1576.1574.1590.1556.
ReferenceSilva-Brandão, Solferini, et al., 2006Ceccarini, Macchia, et al., 2004Grujic-Jovanovic, Skaltsa, et al., 2004Ngassoum, Ousmaila, et al., 2004Tzakou, Vagias, et al., 2004
Comment MSDC-RI MSDC-RI MSDC-RI MSDC-RI MSDC-RI
Column type CapillaryCapillaryCapillaryCapillaryCapillary
Active phase DB-1HP-5HP-5HP-5RTX-5
Column length (m) 30.30.30.30.30.
Carrier gas N2HeN2 He
Substrate
Column diameter (mm) 0.250.250.250.250.25
Phase thickness (μm) 0.250.250.250.250.25
Tstart (C) 50.60.60.60.45.
Tend (C) 200.280.220.280.300.
Heat rate (K/min) 5.4.5.3.3.
Initial hold (min)  5.10.5.6.
Final hold (min) 0.   10.
I 1570.1574.1576.1574.1583.
ReferenceBoyom, Assembe, et al., 2003Skaltsa, Demetzos, et al., 2003Flamini, Cioni, et al., 2002Fokialakis, Magiatis, et al., 2002Mondello, Zappia, et al., 2002
Comment MSDC-RI MSDC-RI MSDC-RI MSDC-RI MSDC-RI
Column type CapillaryCapillaryCapillaryCapillaryCapillary
Active phase HP-1HP-5HP-5HP-5MSMega 5MS
Column length (m) 24.30.30.30.30.
Carrier gas HeHeHeHeHe
Substrate
Column diameter (mm) 0.320.250.250.250.25
Phase thickness (μm) 0.170.250.250.250.25
Tstart (C) 60.60.60.60.40.
Tend (C) 250.280.380.280.240.
Heat rate (K/min) 4.3.3.4.3.
Initial hold (min) 2.  5.2.
Final hold (min) 20.
I 1560.1558.1567.1574.1559.
ReferenceNath, Sarma, et al., 2002Pitarokili, Couladis, et al., 2002Couladis, Tsortanidou, et al., 2001Skaltsa, Mavrommati, et al., 2001Verzera, Trozzi, et al., 2000
Comment MSDC-RI MSDC-RI MSDC-RI MSDC-RI MSDC-RI

Kovats' RI, non-polar column, isothermal

Data compiled by: NIST Mass Spectrometry Data Center, William E. Wallace, director

Column type CapillaryCapillary
Active phase EC-1EC-1
Column length (m) 30.30.
Carrier gas
Substrate
Column diameter (mm) 0.250.25
Phase thickness (μm) 0.250.25
Temperature (C) 130.150.
I 1553.1566.
ReferenceSzafranek, Chrapkowska, et al., 2005Szafranek, Chrapkowska, et al., 2005
Comment MSDC-RI MSDC-RI

Kovats' RI, polar column, temperature ramp

Data compiled by: NIST Mass Spectrometry Data Center, William E. Wallace, director

Column type Capillary
Active phase Supelcowax-10
Column length (m) 30.
Carrier gas
Substrate
Column diameter (mm) 0.25
Phase thickness (μm) 0.25
Tstart (C) 40.
Tend (C) 210.
Heat rate (K/min) 2.
Initial hold (min) 2.
Final hold (min) 33.
I 2050.
ReferenceSylvestre, Pichette, et al., 2006
Comment MSDC-RI

References

Ogunwande, Flamini, et al., 2010
Ogunwande, I.A.; Flamini, G.; Cioni, P.L.; Omikorede, O.; Azeez, R.A.; Ayodele, A.A.; Kamil, Y.O., Aromatic plants growing in Nigeria: essential oil constituents of Cassia alata (Linn.) Roxb. and Helianthus annuus L., Rec. Nat. Prod., 2010, 4, 4, 211-217. [all data]

Karlsson, Birgersson, et al., 2009
Karlsson, M.F.; Birgersson, G.; Prado, A.M.C.; Bosa, F.; Bengtsson, M.; Witzgall, P., Plant Odor Analysis of Potato: Responce of Guatemalan Moth to Above- and Background Potato Volatiles, J. Agric. Food Chem., 2009, 57, 13, 5903-5909, https://doi.org/10.1021/jf803730h . [all data]

Scrivanti, Anton, et al., 2009
Scrivanti, L.R.; Anton, A.M.; Zygadlo, J.A., Essential oil conposition of Bothriochloa Kuntze (Poaceae) from South America and their chemotaxonomy, Biochem. Systematics Ecol., 2009, 37, 3, 206-213, https://doi.org/10.1016/j.bse.2009.03.009 . [all data]

Zhao, Zeng, et al., 2009
Zhao, C.; Zeng, Y.; Wan, M.; Li, R.; Liang, Y.; Li, C.; Zeng, Z.; Chau, F.-T., Comparative analysis of essential oils from eight herbal medicines with pungent flavor and cool nature by GC-MS and chemometric resolution methods, J. Sep. Sci., 2009, 32, 4, 660-670, https://doi.org/10.1002/jssc.200800484 . [all data]

Isidorov, Lech, et al., 2008
Isidorov, V.A.; Lech, P.; Zolciak, A.; Rusak, N.; Szczepaniak, L., Gas Chromatographic - nass spectrometric investigation of metabolites from the needles and roots of pine seedlings at early stages of pathogenic fungi Armillaria ostoyae attack, Trees, 2008, 22, 4, 531-542, https://doi.org/10.1007/s00468-008-0213-z . [all data]

Lo Presti, Sciarrone, et al., 2008
Lo Presti, M.; Sciarrone, D.; Crupi, M.C.; Costa, R.; Ragusa, S.; Dugo, G.; Mondello, L., Evaliation of the volatile and chiral composition in Pistacia lentiscus L. essential oil, Flavour Fragr. J., 2008, 23, 4, 249-257, https://doi.org/10.1002/ffj.1878 . [all data]

Paolini, Tomi, et al., 2008
Paolini, J.; Tomi, P.; Bernardini, A.-F.; Bradesi, P.; Casanova, J.; Kaloustian, J., Detailed analysis of the essential oil from Cistus albidus L. by combination of GC/RI, GC/MS and 13C-NMR spectroscopy, N.Z. J. Agric. Res., 2008, 22, 14, 1270-1278. [all data]

Argyropoulou, Daferera, et al., 2007
Argyropoulou, C.; Daferera, D.; Tarantilis, P.A.; Fasseas, C.; Polissiou, M., Chemical composition of the essential oil from leaves of Lippia citriodora H.B.K. (Verbenaceae) at two developmental stages, Biochem. Syst. Ecol., 2007, 35, 12, 831-837, https://doi.org/10.1016/j.bse.2007.07.001 . [all data]

Cheraif, Ben Jannet, et al., 2007
Cheraif, I.; Ben Jannet, H.; Hammami, M.; Khouja, M.L.; Mighri, Z., Chemical composition and antimicrobial activity of essential oils of Cupressus arizonica Greene, Biochem. Syst. Ecol., 2007, 35, 12, 813-820, https://doi.org/10.1016/j.bse.2007.05.009 . [all data]

Ferhat, Meklati, et al., 2007
Ferhat, M.A.; Meklati, B.Y.; Chemat, F., Comparison of different isolation methods of essential oil from Citrus fruits: cold pressing, hydrodistillation and microwave dry distillation, Flavour Fragr. J., 2007, 22, 6, 494-504, https://doi.org/10.1002/ffj.1829 . [all data]

Ferhat, Tigrine-Kordjani, et al., 2007
Ferhat, M.A.; Tigrine-Kordjani, N.; Chemat, S.; Meklati, B.Y.; Chemat, F., Rapid Extraction of Volatile Compounds Using a New Simultaneous Microwave Distillation: Solvent Extraction Device, Chromatographia, 2007, 65, 3-4, 217-222, https://doi.org/10.1365/s10337-006-0130-5 . [all data]

Gudaityte and Venskutonis R.P., 2007
Gudaityte, O.; Venskutonis R.P., Chemotypes of Achillea millefolium transferred from 14 different locations in Lithuania to the controlled environment, Biochem. Syst. Ecol., 2007, 35, 9, 582-592, https://doi.org/10.1016/j.bse.2007.03.016 . [all data]

Pala-Paul, Brophy, et al., 2007
Pala-Paul, J.; Brophy, J.J.; Perez-Alonso, M.J.; Usano, J.; Soria, S.C., Essential oil composition of the different parts of Eryngium corniculatum Lam. (Apiaceae) from Spain, J. Chromatogr. A, 2007, 1175, 2, 289-293, https://doi.org/10.1016/j.chroma.2007.10.061 . [all data]

Tava, Pecetti, et al., 2007
Tava, A.; Pecetti, L.; Ricci, M.; Pagnotta, M.A.; Russi, L., Volatile compounds from leaves and flowers of Bituminaria bituminosa (L.) Stirt. (Fabaceae) from Italy, Flavour Fragr. J., 2007, 22, 5, 363-370, https://doi.org/10.1002/ffj.1806 . [all data]

Figuérédo, Cabassu, et al., 2006
Figuérédo, G.; Cabassu, P.; Chalchat, J.-C.; Pasquier, B., Studies of Mediterranean oregano populations. VIII. Chemical composition of essential oils of oreganos of various origins, Flavour Fragr. J., 2006, 21, 1, 134-139, https://doi.org/10.1002/ffj.1543 . [all data]

Garneau F.X., Collin G., et al., 2006
Garneau F.X.; Collin G.; Gagnon H.; Jean F.I.; Strobl H.; Pichette A., The essential oil composition of Devil's Club, Oplopanax horridus J. E. Smith Miq., Flavour Fragr. J., 2006, 21, 5, 792-794, https://doi.org/10.1002/ffj.1716 . [all data]

Lis and Milczarek, 2006
Lis, A.; Milczarek, J., Chemical composition of the essential oils from fruits, leaves and flowers of Phellodendron sachalinense (Fr. Schmidt) Sarg., Flavour Fragr. J., 2006, 21, 4, 683-686, https://doi.org/10.1002/ffj.1662 . [all data]

Morteza-Semnani, Akbarzadeh, et al., 2006
Morteza-Semnani, K.; Akbarzadeh, M.; Changizi, S., Essential oils composition of Stachys byzantina, S. inflata, S. lavandulifolia and S. laxa from Iran, Flavour Fragr. J., 2006, 21, 2, 300-303, https://doi.org/10.1002/ffj.1594 . [all data]

Pala-Paul J., Perez-Alonso M.J., et al., 2006
Pala-Paul J.; Perez-Alonso M.J.; Velasco-Negueruela A.; Ballesteros M.T.; Sanz J., Essential oil composition of Sideritis hirsuta L. from Guadalajara Province, Spain, Flavour Fragr. J., 2006, 21, 3, 410-415, https://doi.org/10.1002/ffj.1727 . [all data]

Velasco-Negueruela, Pérez-Alonso, et al., 2006
Velasco-Negueruela, A.; Pérez-Alonso, M.J.; Pérez de Paz, P.L.; Palá-Paúl, J.; Sanz, J., Analysis by gas chromatography?mass spectrometry of the volatiles from the fruits of Ammodaucus leucotrichus subsp. leucotrichus and subsp. nanocarpus grown in North Africa and the Canary Islands, respectively, J. Chromatogr. A, 2006, 1108, 2, 273-275, https://doi.org/10.1016/j.chroma.2006.01.031 . [all data]

Duarte, Figueira, et al., 2005
Duarte, M.C.T.; Figueira, G.M.; Sartoratto, A.; Rehder, V.L.G.; Delarmelina, C., Anti-Candida activity of Brazilian medicinal plants, J. Ethnopharmacol., 2005, 97, 2, 305-311, https://doi.org/10.1016/j.jep.2004.11.016 . [all data]

Jovanovic, Kitic, et al., 2005
Jovanovic, T.; Kitic, D.; Palic, R.; Stojanovic, G.; Ristic, M., Chemical composition and antimicrobial activity of the essential oil of Acinos arvensis (Lam.) Dandy from Serbia, Flavour Fragr. J., 2005, 20, 3, 288-290, https://doi.org/10.1002/ffj.1409 . [all data]

Morteza-Semnani and Saeedi, 2005
Morteza-Semnani, K.; Saeedi, M., The essential oil composition of Phlomis bruguieri Desf. from Iran, Flavour Fragr. J., 2005, 20, 3, 344-346, https://doi.org/10.1002/ffj.1459 . [all data]

Pala-Paul, Perez-Alonso, et al., 2005
Pala-Paul, J.; Perez-Alonso, M.J.; Velasco-Negueruela, A.; Vadare, J.; Villa, A.M.; Sanz, J.; Brophy, J.J., Essential oil composition of the different parts of Eryngium bourgatii Gouan from Spain, J. Chromatogr. A, 2005, 1074, 1-2, 235-239, https://doi.org/10.1016/j.chroma.2005.03.036 . [all data]

Petrakis, Roussis, et al., 2005
Petrakis, P.V.; Roussis, V.; Papadimitriou, D.; Vagias, C.; Tsitsimpikou, C., The effect of terpenoid extracts from 15 pine species on the feeding behavioural sequence of the late instars of the pine processionary caterpillar Thaumetopoea pityocampa, Behav. Processes, 2005, 69, 3, 303-322, https://doi.org/10.1016/j.beproc.2004.12.008 . [all data]

Sajjadi S.E. and Eskandari B., 2005
Sajjadi S.E.; Eskandari B., Chemical constituents of the essential oil of Nepeta oxyodonta, Chem. Nat. Compd. (Engl. Transl.), 2005, 41, 2, 175-177, https://doi.org/10.1007/s10600-005-0106-y . [all data]

Slavkovska, Couladis, et al., 2005
Slavkovska, V.; Couladis, M.; Bojovic, S.; Tzakou, O.; Pavlovic, M.; Lakusic, B.; Jancic, R., Essential oil and its systematic significance in species of Micromeria Bentham from Serbia Montenegro, Plant Systematics and Evolution, 2005, 255, 1-2, 1-15, https://doi.org/10.1007/s00606-005-0303-y . [all data]

Szafranek, Chrapkowska, et al., 2005
Szafranek, B.; Chrapkowska, K.; Pawinska, M.; Szafranek, J., Analysis of leaf surface sesquiterpenes in potato varieties, J. Agric. Food Chem., 2005, 53, 8, 2817-2822, https://doi.org/10.1021/jf040437g . [all data]

Tzakou and Constantinidis, 2005
Tzakou, O.; Constantinidis, T., Chemotaxonomic significance of volatile compounds in Thymus samius and its related species Thymus atticus and Thymus parnassicus, Biochem. Syst. Ecol., 2005, 33, 11, 1131-1140, https://doi.org/10.1016/j.bse.2005.03.008 . [all data]

Urdampilleta, Amat, et al., 2005
Urdampilleta, J.D.; Amat, A.G.; Bidau, C.J.; Koslobsky, N.K., Biosystematic and chemosystematic studies in five South Americal species of Conyza (Asteraceae), Bol. Soc. Argent. Bot., 2005, 40, 1-2, 101-107. [all data]

Agnaniet, Menut, et al., 2004
Agnaniet, H.; Menut, C.; Bessière, J.-M., Aromatic plants of tropical central Africa. Part XLIX: chemical composition of essential oils of the leaf and rhizome of Aframomum giganteum K. Schum from Gabon, Flavour Fragr. J., 2004, 19, 3, 205-209, https://doi.org/10.1002/ffj.1403 . [all data]

Kilic, Hafizoglu, et al., 2004
Kilic, A.; Hafizoglu, H.; Kollmannsberger, H.; Nitz, S., Volatile constituents and key odorants in leaves, buds, flowers, and fruits of Laurus nobilis L., J. Agric. Food Chem., 2004, 52, 6, 1601-1606, https://doi.org/10.1021/jf0306237 . [all data]

Raal, Paaver, et al., 2004
Raal, A.; Paaver, U.; Arak, E.; Orav, A., Content and composition of the essential oil of Thymus serpyllum L. growing wild in Estonia, Medicina (Kaunas), 2004, 40, 8, 795-800. [all data]

Tirillini, Pellegrino, et al., 2004
Tirillini, B.; Pellegrino, R.; Bini, L.M., Essential oil composition of Stachys sylvatica L. from Italy, Flavour Fragr. J., 2004, 19, 4, 330-332, https://doi.org/10.1002/ffj.1308 . [all data]

Dudai, Larkov, et al., 2003
Dudai, N.; Larkov, O.; Chaimovitsh, D.; Lewinsohn, E.; Freiman, L.; Ravid, U., Essential oil compounds of Origanum dayi Post, Flavour Fragr. J., 2003, 18, 4, 334-337, https://doi.org/10.1002/ffj.1237 . [all data]

Sajjadi and Mehregan, 2003
Sajjadi, S.E.; Mehregan, I., Chemical composition of the essential oil of Prangos Asperula Boiss. subsp. haussknechtii (Boiss.) Hernst. et Heyn fruits, 2003, retrieved from http://www1.tums.ac.ir/daru/daru2%2020003/Dr%20Sajadi.PDF. [all data]

Senatore and Bruno, 2003
Senatore, F.; Bruno, M., Composition of the essential oil of Pallenis spinosa (L.) Cass. (Asteraceae), Flavour Fragr. J., 2003, 18, 3, 195-197, https://doi.org/10.1002/ffj.1180 . [all data]

Bos, Koulman, et al., 2002
Bos, R.; Koulman, A.; Woerdenbag, H.J.; Quax, W.J.; Pras, N., Volatile components from Anthriscus sylvestris (L.) Hoffm., J. Chromatogr. A, 2002, 966, 1-2, 233-238, https://doi.org/10.1016/S0021-9673(02)00704-5 . [all data]

Cicció and Gómez-Laurito, 2002
Cicció, J.F.; Gómez-Laurito, J., Volatile constituents of the leaves of Siparuna thecaphora (Siparunaceae) from Turrialba, Costa Rica, Rev. Biol. Trop., 2002, 50, 3/4, 963-967. [all data]

Menut, Bessière, et al., 2002
Menut, C.; Bessière, J.M.; Hassani, M.S.; Buchbauer, G.; Schopper, B., Chemical and biological studies of Ocotea comoriensis bark essential oil, Flavour Fragr. J., 2002, 17, 6, 459-461, https://doi.org/10.1002/ffj.1130 . [all data]

Jacquemond-Collet, Bessière, et al., 2001
Jacquemond-Collet, I.; Bessière, J.-M.; Hannedouche, S.; Bertrand, C.; Fourasté, I.; Moulis, C., Identification of the alkaloids of Galipea officinalis by gas chromatography-mass spectrometry, Phytochem. Anal., 2001, 12, 5, 312-319, https://doi.org/10.1002/pca.594 . [all data]

Ayedoun, Adéoti, et al., 1999
Ayedoun, M.A.; Adéoti, B.S.; Setondji, J.; Tchoumbougnang, F.; Kuiaté, J.R.; Zollo, P.H.A.; Menut, C.; Lamaty, G.; Bessière, J.M., Aromatic plants of tropical West Africa. XII. Essential oil of Hoslundia opposita Vahl. growing in Benin and Cameroon, Flavour Fragr. J., 1999, 14, 5, 319-321, https://doi.org/10.1002/(SICI)1099-1026(199909/10)14:5<319::AID-FFJ836>3.0.CO;2-O . [all data]

Koulman, 1999
Koulman, A., Podophyllotoxin: a study of biosynthesis, evolution, function, and use of podophyllotoxin and related lignans, University Library Groningen, Nederlands, 1999, 188, retrieved from http://www.ub.rug.nl/eldoc/dis/science/a.koulman/. [all data]