Phenol, 4-(1-phenylethyl)-

Phase change data

Data compiled by: William E. Acree, Jr., James S. Chickos

Enthalpy of vaporization

ΔvapH (kcal/mol) Temperature (K) Method Reference Comment
21.7462.AStephenson and Malanowski, 1987Based on data from 447. - 517. K.
18.0485.N/AGoldblum, Martin, et al., 1947Based on data from 447. - 523. K.

References

Stephenson and Malanowski, 1987
Stephenson, Richard M.; Malanowski, Stanislaw, Handbook of the Thermodynamics of Organic Compounds, 1987, https://doi.org/10.1007/978-94-009-3173-2 . [all data]

Goldblum, Martin, et al., 1947
Goldblum, K.B.; Martin, R.W.; Young, R.B., Vapor Pressure Data for Phenols, Ind. Eng. Chem., 1947, 39, 11, 1474-1476, https://doi.org/10.1021/ie50455a017 . [all data]