Pyrimethanil phenoxyacetate

Phase change data

Data compiled by: William E. Acree, Jr., James S. Chickos

Enthalpy of fusion

ΔfusH (kcal/mol) Temperature (K) Method Reference Comment
8.193349.4ACSun, Liu, et al., 2006Based on data from 81. - 380. K.

References

Sun, Liu, et al., 2006
Sun, X.-H.; Liu, Y.-F.; Tan, Z.-C.; Jia, Y.-Q.; Wang, M.-H., Gaodeng Xuexiao Huaxue Xuebao, 2006, 27, 6, 1109. [all data]