Thiirane, (methoxymethyl)-

Gas phase ion energetics data

Data compiled as indicated in comments:
LBLHLM - Sharon G. Lias, John E. Bartmess, Joel F. Liebman, John L. Holmes, Rhoda D. Levin, and W. Gary Mallard
LLK - Sharon G. Lias, Rhoda D. Levin, and Sherif A. Kafafi

Ionization energy determinations

IE (eV) Method Reference Comment
8.4PERodin, Chistyakov, et al., 1985LBLHLM
8.82PERodin, Chistyakov, et al., 1985Vertical value; LBLHLM
8.77PEMcAlduff and Houk, 1977Vertical value; LLK

References

Rodin, Chistyakov, et al., 1985
Rodin, A.A.; Chistyakov, A.B.; Sarkisov, Y.S.; Sergeev, Y.L.; V'yunov, K.A.; Golovin, A.V., Electronic structure and geometric structure of three-member J. Heterocycl. Chem.. I. hotoelectron spectra of gylcidyl and thioglycidyl ethers, Russ. J. Phys. Chem., 1985, 59, 444, In original 764. [all data]

McAlduff and Houk, 1977
McAlduff, E.J.; Houk, K.N., Photoelectron spectra of substituted oxiranes and thiiranes. Substituent effects on ionization potentials involving σ orbitals, Can. J. Chem., 1977, 55, 318. [all data]