Benzene, (1,1-dimethylbutyl)-
- Formula: C12H18
- Molecular weight: 162.2713
- IUPAC Standard InChIKey: PIUUDKDOAUICQP-UHFFFAOYSA-N
- CAS Registry Number: 1985-57-5
- Chemical structure:

Normal alkane RI, non-polar column, isothermal

Column type | Active phase | Temperature (C) | I | Reference | Comment |
---|---|---|---|---|---|
Capillary | Squalane | 140. | 1168. | Protic, Svob, et al., 1980 | He; Column length: 100. m; Column diameter: 0.25 mm |

Normal alkane RI, polar column, temperature ramp

Column type | Active phase | I | Reference | Comment |
---|---|---|---|---|
Capillary | Carbowax 20M | 1378. | Herain, MRAVEC, et al., 1991 | 70. C @ 21. min, 5. K/min, 150. C @ 999. min |

References

Protic, Svob, et al., 1980
Protic, G.; Svob, V.; Deur-Siftar, D.,
Mass spectrometric and gas chromatographic data in hydrocarbon analyse,
Sci. Papers of the Prague Institute of Chem. Technol., 1980, D42, 139-147. [all data]
Herain, MRAVEC, et al., 1991
Herain, J.; MRAVEC, D.; SCHNIERER, A.,
identification of the components of the reaction mixtures from transalkylation of the waste fraction of diisopropylbenzenes by capillary GC and GC-MS,
Chem. Listy, 1991, 85, 5, 535-538. [all data]