Cyanopyrazine

Phase change data

Data compiled by: William E. Acree, Jr., James S. Chickos

Quantity Value Units Method Reference Comment
Δvap14.0 ± 0.29kcal/molCRibeiro da Silva, Miranda, et al., 2005

References

Ribeiro da Silva, Miranda, et al., 2005
Ribeiro da Silva, Maria D.M.C.; Miranda, Margarida S.; Vaz, Cláudia M.V.; Matos, M. Agostinha R.; Acree, W.E., Experimental thermochemical study of three monosubstituted pyrazines, The Journal of Chemical Thermodynamics, 2005, 37, 1, 49-53, https://doi.org/10.1016/j.jct.2004.08.006 . [all data]