3-Methoxy-2,5-dimethylpyrazine

Normal alkane RI, non-polar column, custom temperature program

Data compiled by: NIST Mass Spectrometry Data Center, William E. Wallace, director

Column type Capillary
Active phase DB-5
Column length (m)
Carrier gas
Substrate
Column diameter (mm)
Phase thickness (μm)
Program not specified
I 1057.
ReferenceMolyneux and Schieberle, 2007
Comment MSDC-RI

Normal alkane RI, polar column, temperature ramp

Data compiled by: NIST Mass Spectrometry Data Center, William E. Wallace, director

Column type Capillary
Active phase DB-Wax
Column length (m) 30.
Carrier gas
Substrate
Column diameter (mm) 0.25
Phase thickness (μm) 0.25
Tstart (C) 40.
Tend (C) 200.
Heat rate (K/min) 8.
Initial hold (min) 3.
Final hold (min) 20.
I 1385.
ReferenceSchirack, Drake, et al., 2006
Comment MSDC-RI

References

Molyneux and Schieberle, 2007
Molyneux, R.J.; Schieberle, P., Compound identification: a Journal of Agricultural and Food Chemistry perspective, J. Agric. Food Chem., 2007, 55, 12, 4625-4629, https://doi.org/10.1021/jf070242j . [all data]