N-Nitrobis-(2,2,2-trinitroethyl)amine

Gas phase thermochemistry data

Data compiled by: Hussein Y. Afeefy, Joel F. Liebman, and Stephen E. Stein

Quantity Value Units Method Reference Comment
Δfgas89.6 ± 2.2kJ/molCcbPepekin, Gafurov, et al., 1973Reanalyzed by Cox and Pilcher, 1970, Original value = 90. ± 3. kJ/mol

Condensed phase thermochemistry data

Data compiled by: Hussein Y. Afeefy, Joel F. Liebman, and Stephen E. Stein

Quantity Value Units Method Reference Comment
Δfsolid-28.0 ± 1.7kJ/molCcbKustova, Kirpichev, et al., 1981
Δfsolid-27.kJ/molCcbPepekin, Gafurov, et al., 1973
Quantity Value Units Method Reference Comment
Δcsolid-2117.5kJ/molCcbKustova, Kirpichev, et al., 1981
Δcsolid-2118. ± 2.8kJ/molCcbPepekin, Gafurov, et al., 1973
Δcsolid-2033.kJ/molCcbYoung, Keith, et al., 1956

Phase change data

Data compiled as indicated in comments:
AC - William E. Acree, Jr., James S. Chickos
ALS - Hussein Y. Afeefy, Joel F. Liebman, and Stephen E. Stein

Enthalpy of sublimation

ΔsubH (kJ/mol) Temperature (K) Method Reference Comment
117.6 ± 0.8348.MEde Kruif and Oonk, 1973Based on data from 340. - 356. K.; AC
118. ± 0.8340.VPepekin, Gafurov, et al., 1973ALS

References

Pepekin, Gafurov, et al., 1973
Pepekin, V.I.; Gafurov, R.G.; Lebedev, Yu.A.; Eremenko, L.T.; Sogomonyan, E.M.; Apin, A.Ya., Thermochemistry of N-Nitrosoamines, Bull. Acad. Sci. USSR, Div. Chem. Sci., 1973, 304-307. [all data]

Cox and Pilcher, 1970
Cox, J.D.; Pilcher, G., Thermochemistry of Organic and Organometallic Compounds, Academic Press, New York, 1970, 1-636. [all data]

Kustova, Kirpichev, et al., 1981
Kustova, L.V.; Kirpichev, E.P.; Rubtsov, Yu.I.; Avdonin, V.V.; Korepin, A.G.; Eremenko, L.T., Standard enthalpies of formation of certain nitro compounds, Bull. Acad. Sci. USSR, Div. Chem. Sci., 1981, 1830-1836. [all data]

Young, Keith, et al., 1956
Young, J.A.; Keith, J.E.; Stehle, P.; Dzombak, W.C.; Hunt, H., Heats of combustion of some organic nitrogen compounds, Ind. Eng. Chem., 1956, 48, 1375-1378. [all data]