C6H5CCl

Vibrational and/or electronic energy levels

Data compiled by: Marilyn E. Jacox

State:   ?

 Energy
 (cm-1
 Med.   Transition   λmin
 (nm)
 λmax
 (nm)

References

Tx = 36200 Ar Sander, 1987

State:   ?

 Energy
 (cm-1
 Med.   Transition   λmin
 (nm)
 λmax
 (nm)

Tx = 33300 Ar Ganzer, Sheridan, et al., 1986

State:   X

Vib.
sym.
 No.   Approximate
 type of mode
 cm-1   Med.   Method   References

1600 m Ar IR Ganzer, Sheridan, et al., 1986
Sander, 1987
McMahon, Abelt, et al., 1987
1582 s Ar IR Ganzer, Sheridan, et al., 1986
Sander, 1987
McMahon, Abelt, et al., 1987
1477 w Ar IR Mal'tsev, Zuev, et al., 1985
Ganzer, Sheridan, et al., 1986
Sander, 1987
McMahon, Abelt, et al., 1987
1440 m Ar IR Mal'tsev, Zuev, et al., 1985
Ganzer, Sheridan, et al., 1986
Sander, 1987
McMahon, Abelt, et al., 1987
1318 w Ar IR Mal'tsev, Zuev, et al., 1985
Ganzer, Sheridan, et al., 1986
Sander, 1987
McMahon, Abelt, et al., 1987
1301 m Ar IR Mal'tsev, Zuev, et al., 1985
Ganzer, Sheridan, et al., 1986
Sander, 1987
McMahon, Abelt, et al., 1987
1244 m Ar IR Mal'tsev, Zuev, et al., 1985
Ganzer, Sheridan, et al., 1986
Sander, 1987
McMahon, Abelt, et al., 1987
1222 vs Ar IR Mal'tsev, Zuev, et al., 1985
Ganzer, Sheridan, et al., 1986
Sander, 1987
McMahon, Abelt, et al., 1987
1205 w Ar IR Ganzer, Sheridan, et al., 1986
1168 s Ar IR Mal'tsev, Zuev, et al., 1985
Ganzer, Sheridan, et al., 1986
Sander, 1987
McMahon, Abelt, et al., 1987
995 w Ar IR Ganzer, Sheridan, et al., 1986
McMahon, Abelt, et al., 1987
840 vs Ar IR Mal'tsev, Zuev, et al., 1985
Ganzer, Sheridan, et al., 1986
Sander, 1987
McMahon, Abelt, et al., 1987
761 m Ar IR Mal'tsev, Zuev, et al., 1985
Ganzer, Sheridan, et al., 1986
Sander, 1987
McMahon, Abelt, et al., 1987
744 vs Ar IR Mal'tsev, Zuev, et al., 1985
Ganzer, Sheridan, et al., 1986
Sander, 1987
McMahon, Abelt, et al., 1987
671 s Ar IR Mal'tsev, Zuev, et al., 1985
Ganzer, Sheridan, et al., 1986
Sander, 1987
McMahon, Abelt, et al., 1987
563 w Ar IR Mal'tsev, Zuev, et al., 1985
Ganzer, Sheridan, et al., 1986
Sander, 1987
McMahon, Abelt, et al., 1987

Additional references: Jacox, 1994, page 440

Sander, 1987
Sander, W., Spectrochim. Acta, 1987, 43A, 637. [all data]

Ganzer, Sheridan, et al., 1986
Ganzer, G.A.; Sheridan, R.S.; Liu, M.T.H., Reaction of phenylchlorocarbene in oxygen-doped matrices, J. Am. Chem. Soc., 1986, 108, 7, 1517, https://doi.org/10.1021/ja00267a022 . [all data]

McMahon, Abelt, et al., 1987
McMahon, R.J.; Abelt, C.J.; Chapman, O.L.; Johnson, J.W.; Kreil, C.L.; LeRoux, J.-P.; Mooring, A.M.; West, P.R., 1,2,4,6-Cycloheptatetraene: the key intermediate in arylcarbene interconversions and related C7H6 rearrangements, J. Am. Chem. Soc., 1987, 109, 8, 2456, https://doi.org/10.1021/ja00242a034 . [all data]

Mal'tsev, Zuev, et al., 1985
Mal'tsev, A.K.; Zuev, P.S.; Nefedov, O.M., Izv. Akad. Nauk SSSR, 1985, Ser. Khim., 2159. [all data]

Jacox, 1994
Jacox, M.E., Vibrational and electronic energy levels of polyatomic transient molecules, American Chemical Society, Washington, DC, 1994, 464. [all data]