3-Hexanol, 4-ethyl-

Normal alkane RI, non-polar column, custom temperature program

Data compiled by: NIST Mass Spectrometry Data Center, William E. Wallace, director

Column type CapillaryCapillaryCapillary
Active phase Methyl SiliconePolydimethyl siloxaneMethyl Silicone
Column length (m)
Carrier gas
Substrate
Column diameter (mm)
Phase thickness (μm)
Program not specifiednot specifiednot specified
I 953.953.953.
ReferenceFeng and Mu, 2007Junkes, Castanho, et al., 2003Estrada and Gutierrez, 1999
Comment MSDC-RI MSDC-RI MSDC-RI

Phase change data

Data compiled by: Thermodynamics Research Center, NIST Boulder Laboratories, Chris Muzny director

Quantity Value Units Method Reference Comment
Tboil436.15KN/AFourneau and Tiffeneau, 1907Uncertainty assigned by TRC = 3. K
Tboil438.15KN/AWinogradow, 1878Uncertainty assigned by TRC = 5. K

In addition to the Thermodynamics Research Center (TRC) data available from this site, much more physical and chemical property data is available from the following TRC products:

References

Feng and Mu, 2007
Feng, H.; Mu, L.-L., Quantitative structure-retention relationships for alkane and its derivatives based on electrotopological state index and molecular shape index, Chem. Ind. Engineering (Chinese), 2007, 24, 2, 161-168. [all data]

Junkes, Castanho, et al., 2003
Junkes, B.S.; Castanho, R.D.M.; Amboni, C.; Yunes, R.A.; Heinzen, V.E.F., Semiempirical Topological Index: A Novel Molecular Descriptor for Quantitative Structure-Retention Relationship Studies, Internet Electronic Journal of Molecular Design, 2003, 2, 1, 33-49. [all data]

Estrada and Gutierrez, 1999
Estrada, E.; Gutierrez, Y., Modeling chromatographic parameters by a novel graph theoretical sub-structural approach, J. Chromatogr. A, 1999, 858, 2, 187-199, https://doi.org/10.1016/S0021-9673(99)00808-0 . [all data]