Loxapine

Van Den Dool and Kratz RI, non-polar column, temperature ramp

View large format table.

Column type Active phase I Reference Comment
CapillarySE-302542.Anderson and Stafford, 198315. m/0.25 mm/0.25 μm, He, 5. K/min; Tstart: 100. C; Tend: 295. C

Normal alkane RI, non-polar column, custom temperature program

View large format table.

Column type Active phase I Reference Comment
CapillaryOV-1, SE-30, Methyl silicone, SP-2100, OV-101, DB-1, etc.2542.Waggott and Davies, 1984Hydrogen; Column length: 50. m; Column diameter: 0.32 mm; Program: not specified
OtherMethyl Silicone2530.Ardrey and Moffat, 1981Program: not specified

References

Anderson and Stafford, 1983
Anderson, W.H.; Stafford, D.T., Applications of capillary gas chromatography in routine toxicological analyses, J. Hi. Res. Chromatogr. Chromatogr. Comm., 1983, 6, 5, 247-254, https://doi.org/10.1002/jhrc.1240060506 . [all data]

Waggott and Davies, 1984
Waggott, A.; Davies, I.W., Identification of organic pollutants using linear temperature programmed retention indices (LTPRIs) - Part II, 1984, retrieved from http://dwi.defra.gov.uk/research/completed-research/reports/dwi0383.pdf. [all data]

Ardrey and Moffat, 1981
Ardrey, R.E.; Moffat, A.C., Gas-liquid chromatographic retention indices of 1318 substances of toxicological interest on SE-30 or OV-1 stationary phase, J. Chromatogr., 1981, 220, 3, 195-252, https://doi.org/10.1016/S0021-9673(00)81925-1 . [all data]