Heptane, 3-bromo-

Kovats' RI, non-polar column, isothermal

View large format table.

Column type Active phase Temperature (C) I Reference Comment
PackedApiezon L100.1036.Castello and D'Amato, 1985He, Chromosorb W AW DMCS; Column length: 3. m
PackedApiezon L125.1048.Castello and D'Amato, 1985He, Chromosorb W AW DMCS; Column length: 3. m
PackedApiezon L75.1022.Castello and D'Amato, 1985He, Chromosorb W AW DMCS; Column length: 3. m

Kovats' RI, polar column, isothermal

View large format table.

Column type Active phase Temperature (C) I Reference Comment
PackedCarbowax 20M100.1163.Castello and D'Amato, 1985He, Chromosorb W AW DMCS; Column length: 3. m
PackedCarbowax 20M125.1181.Castello and D'Amato, 1985He, Chromosorb W AW DMCS; Column length: 3. m
PackedCarbowax 20M75.1156.Castello and D'Amato, 1985He, Chromosorb W AW DMCS; Column length: 3. m

Normal alkane RI, non-polar column, isothermal

View large format table.

Column type Active phase Temperature (C) I Reference Comment
CapillaryApiezon L130.988.Arruda, Junkes, et al., 2008

References

Castello and D'Amato, 1985
Castello, G.; D'Amato, G., Gas Chromatography Separation and Identification of Linear and Branched-Chain Alkyl Bromides, J. Chromatogr., 1985, 324, 363-371, https://doi.org/10.1016/S0021-9673(01)81335-2 . [all data]

Arruda, Junkes, et al., 2008
Arruda, A.C.S.; Junkes, B. da.S.; Souza, E.S.; Yunes, R.A.; Heizen, V.E.F., Semi-Emlirical Topological Index to Predict Properties of Halogenated Aliphatic Compounds, J. Chemometrics, 2008, 22, 3-4, 186-194, https://doi.org/10.1002/cem.1121 . [all data]