2,2-Dimethyladamantane

Kovats' RI, non-polar column, isothermal

View large format table.

Column type Active phase Temperature (C) I Reference Comment
CapillarySE-30145.1269.Bogoslovsky, Anvaer, et al., 1978
CapillarySE-30145.1269.Burkhard, Vais, et al., 1969N2; Column length: 50. m; Column diameter: 0.27 mm
CapillarySE-30160.1281.Burkhard, Vais, et al., 1969N2; Column length: 50. m; Column diameter: 0.27 mm
CapillarySE-30175.1296.Burkhard, Vais, et al., 1969N2; Column length: 50. m; Column diameter: 0.27 mm
CapillarySE-30190.1309.Burkhard, Vais, et al., 1969N2; Column length: 50. m; Column diameter: 0.27 mm

Kovats' RI, polar column, isothermal

View large format table.

Column type Active phase Temperature (C) I Reference Comment
CapillaryCarbowax 20M145.1479.Burkhard, Vais, et al., 1969N2; Column length: 50. m; Column diameter: 0.27 mm
CapillaryCarbowax 20M160.1500.Burkhard, Vais, et al., 1969N2; Column length: 50. m; Column diameter: 0.27 mm
CapillaryCarbowax 20M175.1523.Burkhard, Vais, et al., 1969N2; Column length: 50. m; Column diameter: 0.27 mm

Normal alkane RI, non-polar column, custom temperature program

View large format table.

Column type Active phase I Reference Comment
CapillaryPolydimethyl siloxane1269.Bayat and Abad, 2011Program: not specified
CapillaryPolydimethyl siloxane1269.Bayat and Abad M.F.Y., 2011Program: not specified

Phase change data

Data compiled as indicated in comments:
ALS - Hussein Y. Afeefy, Joel F. Liebman, and Stephen E. Stein
DRB - Donald R. Burgess, Jr.
AC - William E. Acree, Jr., James S. Chickos

Quantity Value Units Method Reference Comment
Δsub74. ± 1.kJ/molVSteele and Watt, 1977ALS
Δsub73.0kJ/molN/ASteele and Watt, 1977DRB
Δsub73.6 ± 1.3kJ/molBGSteele and Watt, 1977Based on data from 300. - 360. K.; AC

Condensed phase thermochemistry data

Data compiled by: Hussein Y. Afeefy, Joel F. Liebman, and Stephen E. Stein

Quantity Value Units Method Reference Comment
Δfsolid-61.3 ± 0.6kcal/molCcbSteele and Watt, 1977
Quantity Value Units Method Reference Comment
Δcsolid-1750.5 ± 0.6kcal/molCcbSteele and Watt, 1977Corresponding Δfsolid = -61.3 kcal/mol (simple calculation by NIST; no Washburn corrections)

References

Bogoslovsky, Anvaer, et al., 1978
Bogoslovsky, Yu.N.; Anvaer, B.I.; Vigdergauz, M.S., Chromatographic constants in gas chromatography (in Russian), Standards Publ. House, Moscow, 1978, 192. [all data]

Burkhard, Vais, et al., 1969
Burkhard, J.; Vais, J.; Vodicka, L.; Landa, S., Adamantane and its derivatives. XVI. The gas chromatographic characterization of adamantane derivatives, J. Chromatogr., 1969, 42, 207-218, https://doi.org/10.1016/S0021-9673(01)80617-8 . [all data]

Bayat and Abad, 2011
Bayat, Z.; Abad, M.F.Y., Quantitative structure-property relationship (QSPR) study of Kovats retention indices of some of adamantane derivatives by the genetic algorithm amd nultiply linear regression (GA-MLR) method, Petroleum Coal, 2011, 53, 2, 132-140. [all data]

Bayat and Abad M.F.Y., 2011
Bayat, Z.; Abad M.F.Y., Computational approaches to the prediction of the Kovats retention index (RI) for adamantane derivatives (AD) as a drug, J. Chem. Pharm. Res., 2011, 3, 1, 48-55. [all data]