D-N-Benzyl tartarimide

Condensed phase thermochemistry data

Data compiled by: Hussein Y. Afeefy, Joel F. Liebman, and Stephen E. Stein

Quantity Value Units Method Reference Comment
Δcsolid-5182.42kJ/molCcbVerkade, Coops, et al., 1925

References

Verkade, Coops, et al., 1925
Verkade, P.E.; Coops, J.; Hartman, H., VIII. The paraffin oil method; an aid in the determination of the heats of combustion of difficultly combustible and hygroscopic substances, Recl. Trav. Chim. Pays-Bas, 1925, 44, 206-216. [all data]