4a(2H)-Naphthalenol, octahydro-4,8a-dimethyl-,(4α,4aα,8aβ)-

Van Den Dool and Kratz RI, non-polar column, temperature ramp

View large format table.

Column type Active phase I Reference Comment
CapillaryBPX-51430.Dickschat, Wenzel, et al., 200425. m/0.22 mm/0.25 μm, He, 50. C @ 5. min, 5. K/min; Tend: 300. C

Van Den Dool and Kratz RI, non-polar column, custom temperature program

View large format table.

Column type Active phase I Reference Comment
CapillaryDB-5MS1439.Selli, Rannou, et al., 200630. m/0.32 mm/0.5 μm, He; Program: 50C => 5C/min => 200C => 8C/min => 260C(5min)
CapillaryPONA1423.Cantergiani, Brevard, et al., 2001Program: not specified

Van Den Dool and Kratz RI, polar column, temperature ramp

View large format table.

Column type Active phase I Reference Comment
CapillaryDB-Wax1821.Selli, Rannou, et al., 200630. m/0.25 mm/0.5 μm, He, 4. K/min, 260. C @ 5. min; Tstart: 50. C

Van Den Dool and Kratz RI, polar column, custom temperature program

View large format table.

Column type Active phase I Reference Comment
CapillaryDB-Wax1808.Cantergiani, Brevard, et al., 200130. m/0.25 mm/0.25 μm; Program: 20C(30s) => fast => 60C => 4C/min => 220C (20min)
CapillaryDB-Wax1823.Cantergiani, Brevard, et al., 200130. m/0.25 mm/0.25 μm; Program: 20C(30s) => fast => 60C => 4C/min => 220C (20min)

Normal alkane RI, non-polar column, temperature ramp

View large format table.

Column type Active phase I Reference Comment
CapillaryBPX51430.Dickschat, Bode, et al., 200525. m/0.22 mm/0.25 μm, Helium, 50. C @ 5. min, 5. K/min; Tend: 320. C
CapillaryBPX-51431.Dickschat, Martens, et al., 200525. m/0.22 mm/0.25 μm, He, 50. C @ 5. min, 5. K/min; Tend: 320. C
CapillaryDB-5MS1417.Suriyaphan, Drake, et al., 200130. m/0.32 mm/0.25 μm, He, 40. C @ 5. min, 5. K/min, 195. C @ 40. min
CapillaryHP-51444.Larsen and Frisvad, 199535. C @ 2. min, 6. K/min; Tend: 200. C
CapillaryHP-51423.Spadone, Takeoka, et al., 1990H2, 16. K/min; Column length: 50. m; Column diameter: 0.3 mm; Tstart: 80. C; Tend: 250. C

Normal alkane RI, non-polar column, custom temperature program

View large format table.

Column type Active phase I Reference Comment
CapillaryOV-11384.Waggott and Davies, 1984Hydrogen; Column length: 50. m; Column diameter: 0.32 mm; Program: not specified
CapillaryOV-1, SE-30, Methyl silicone, SP-2100, OV-101, DB-1, etc.1384.Waggott and Davies, 1984Hydrogen; Column length: 50. m; Column diameter: 0.32 mm; Program: not specified

Normal alkane RI, polar column, temperature ramp

View large format table.

Column type Active phase I Reference Comment
CapillaryDB-Wax1810.Pollak and Berger, 199630. m/0.32 mm/0.5 μm, He, 40. C @ 1. min, 3. K/min, 210. C @ 25. min

Normal alkane RI, polar column, custom temperature program

View large format table.

Column type Active phase I Reference Comment
CapillaryDB-Wax1858.Prat, Trias, et al., 200930. m/0.32 mm/0.50 μm, Hydrogen; Program: 40 0C 2 0C/min -> 12 0C/min -> 105 0C 6 0C/min -> 220 0C (20 min)
CapillarySuperox 0.6; Carbowax 20M1789.Waggott and Davies, 1984Hydrogen; Column length: 50. m; Column diameter: 0.32 mm; Program: not specified
CapillaryCarbowax 400, Carbowax 20M, Carbowax 1540, Carbowax 4000, Superox 06, PEG 20M, etc.1789.Waggott and Davies, 1984Hydrogen; Column length: 50. m; Column diameter: 0.32 mm; Program: not specified

References

Dickschat, Wenzel, et al., 2004
Dickschat, J.S.; Wenzel, S.C.; Bode, H.B.; Muller, R.; Schulz, S., Biosynthesis of Volatiles by the Myxobacterium Myxococcus xanthus, ChemBioChem, 2004, 5, 6, 778-787, https://doi.org/10.1002/cbic.200300813 . [all data]

Selli, Rannou, et al., 2006
Selli, S.; Rannou, C.; Prost, C.; Robin, J.; Serot, T., Characterization of Aroma-Active Compounds in Rainbow Trout (Oncorhynchus mykiss) Eliciting an Off-Odor, J. Agric. Food Chem., 2006, 54, 25, 9496-9502, https://doi.org/10.1021/jf0619582 . [all data]

Cantergiani, Brevard, et al., 2001
Cantergiani, E.; Brevard, H.; Krebs, Y.; Feria-Morales, A.; Amadò, R.; Yeretzian, C., Characterisation of the aroma of green Mexican coffee and identification of mouldy/earthy defect, Eur. Food Res. Technol., 2001, 212, 6, 648-657, https://doi.org/10.1007/s002170100305 . [all data]

Dickschat, Bode, et al., 2005
Dickschat, J.S.; Bode, H.B.; Wenzel, S.C.; Muller, R.; Schulz, S., Biosinthesis and Identification of Volatiles Released by the Myxobacterium Stigmatella aurantiaca, ChemBioChem, 2005, 6, 11, 2023-2033, https://doi.org/10.1002/cbic.200500174 . [all data]

Dickschat, Martens, et al., 2005
Dickschat, J.S.; Martens, T.; Brinkhoff, T.; Simon, M.; Schulz, S., Volatiles released by a Streptomyces species isolated from the North Sea, Chemistry and Biodiversity, 2005, 2, 7, 837-865, https://doi.org/10.1002/cbdv.200590062 . [all data]

Suriyaphan, Drake, et al., 2001
Suriyaphan, O.; Drake, M.; Chen, X.Q.; Cadwallader, K.R., Characteristic aroma components of British farmhouse cheddar cheese, J. Agric. Food Chem., 2001, 49, 3, 1382-1387, https://doi.org/10.1021/jf001121l . [all data]

Larsen and Frisvad, 1995
Larsen, T.O.; Frisvad, J.C., Characterization of volatile metabolites from 47 Penicillium taxa, Mycol. Res., 1995, 99, 10, 1153-1166, https://doi.org/10.1016/S0953-7562(09)80271-2 . [all data]

Spadone, Takeoka, et al., 1990
Spadone, J.-C.; Takeoka, G.; Liardon, R., Analytical Investigation of Rio Off-Flavor in Green Coffee, J. Agric. Food Chem., 1990, 38, 1, 226-233, https://doi.org/10.1021/jf00091a050 . [all data]

Waggott and Davies, 1984
Waggott, A.; Davies, I.W., Identification of organic pollutants using linear temperature programmed retention indices (LTPRIs) - Part II, 1984, retrieved from http://dwi.defra.gov.uk/research/completed-research/reports/dwi0383.pdf. [all data]

Pollak and Berger, 1996
Pollak, F.C.; Berger, R.G., Geosmin and Related Volatiles in Bioreactor-Cultured Streptomyces citreus CBS 109.60, Appl. Environ. Microbiol., 1996, 62, 4, 1295-1299. [all data]

Prat, Trias, et al., 2009
Prat, C.; Trias, R.; Cullere, L.; Escudero, A.; Antico, E.; BAneras, L., Off-odor compounds produced in cork by isolated bacteria and fungi: a gas chromatography - mass spectrometry and gas chromatography - olfactometry study, J. Agric. Food Chem., 2009, 57, 16, 7473-7479, https://doi.org/10.1021/jf900723s . [all data]