Cr(O2) radical

Gas phase ion energetics data

Data compiled by: John E. Bartmess

Electron affinity determinations

EA (eV) Method Reference Comment
1.500 ± 0.060LPESGutsev, Jena, et al., 2001

References

Gutsev, Jena, et al., 2001
Gutsev, G.L.; Jena, P.; Zhai, H.J.; Wang, L.S., Electronic structure of chromium oxides, CrOn- and CrOn (n=1-5) from photoelectron spectroscopy and density functional theory calculations, J. Chem. Phys., 2001, 115, 17, 7935-7944, https://doi.org/10.1063/1.1405438 . [all data]